germline_id; change number by the date of last release

link to #3910
Status Job ID Name Coverage
  Test Tools
passed #341296
test_tools

00:00:06

 
  Test Unit
failed #341297
test_algo_unit

00:03:02

 
  Test Functional
skipped #341298
test_algo_should
 
  Test Shouldvdj
skipped #341299
test_algo_shouldvdj
 
  Coverage
skipped #341300
algo_coverage
 
  Prepare Release
skipped #341301
allowed to fail manual
prepare_release
 
  Valgrind Unit
skipped #341302
valgrind
algo_valgrind_unit
 
  Valgrind Functional
skipped #341303
valgrind allowed to fail manual
algo_valgrind_functional
 
  Multiple Tests
skipped #341304
several-compilers allowed to fail manual
test_various_compilers_manual
 
Name Stage Failure
failed
test_algo_unit Test Unit
make[2]: *** [test] Aborted
make[2]: Leaving directory '/home/gitlab-runner/builds/b8d876c1/0/vidjil/vidjil/algo/tests'
Makefile:174: recipe for target 'unit' failed
make[1]: *** [unit] Error 2
make[1]: Leaving directory '/home/gitlab-runner/builds/b8d876c1/0/vidjil/vidjil/algo'
Makefile:209: recipe for target 'unit_coverage' failed
make: *** [unit_coverage] Error 2
make: Leaving directory '/home/gitlab-runner/builds/b8d876c1/0/vidjil/vidjil/algo'
ERROR: Job failed: exit status 1