#################################
##### Polar code simulation #####
#
#### Simulation parameters ####
# Number of information bits (k) = 1707
# Codeword length            (n) = 2048
# SNR min                        = 4 dB
# SNR max                        = 4 dB
# SNR step                       = 0.1 dB
# Max frame error count     (fe) = 500
# Domain                         = LLR
# Systematic encoding/decoding   = enabled
# Channel type                   = RAND_NORM
# Type of codewords              = All zero
# Decoding algorithm             = SC_N2048_K1707_SNR40
# Decoding iterations per frame  = 1
# Type of bits               (B) = signed char (1 bytes)
# Type of reals              (R) = float       (4 bytes)
# Type of quantified reals   (Q) = signed char (1 bytes)
#
# The simulation is running...
# -----|---------|---------|------|---------|----------|----------||---------|---------|----------|---------|---------|---------|----------
#  SNR |     FRA |      BE |   FE |   BE/FE |      BER |      FER ||    LOAD |   STORE |   DECODE |    CTHR |    ITHR | LATENCY |    ET/RT 
# (dB) |         |         |      |         |          |          ||    (ms) |    (ms) |     (ms) |  (Mb/s) |  (Mb/s) |    (us) | (hhmmss) 
# -----|---------|---------|------|---------|----------|----------||---------|---------|----------|---------|---------|---------|----------
  4.00 |    2208 |     584 |   26 |   22.46 | 1.55e-04 | 1.18e-02 ||    0.55 |    0.04 |     2.64 | 1397.80 | 1165.06 |   23.44 | 00h00'09 *  4.00 |    4448 |    1039 |   50 |   20.78 | 1.37e-04 | 1.12e-02 ||    1.10 |    0.08 |     5.28 | 1408.68 | 1174.13 |   23.26 | 00h00'09 *  4.00 |    6688 |    1658 |   74 |   22.41 | 1.45e-04 | 1.11e-02 ||    1.65 |    0.12 |     7.93 | 1411.19 | 1176.22 |   23.22 | 00h00'08    4.00 |    8928 |    2504 |  107 |   23.40 | 1.64e-04 | 1.20e-02 ||    2.20 |    0.16 |    10.57 | 1413.47 | 1178.12 |   23.18 | 00h00'07    4.00 |   11168 |    3124 |  131 |   23.85 | 1.64e-04 | 1.17e-02 ||    2.76 |    0.20 |    13.21 | 1414.24 | 1178.76 |   23.17 | 00h00'07 *  4.00 |   13408 |    3661 |  153 |   23.93 | 1.60e-04 | 1.14e-02 ||    3.31 |    0.24 |    15.86 | 1414.69 | 1179.14 |   23.16 | 00h00'06 *  4.00 |   15648 |    4425 |  187 |   23.66 | 1.66e-04 | 1.20e-02 ||    3.86 |    0.29 |    18.51 | 1414.81 | 1179.24 |   23.16 | 00h00'05    4.00 |   17888 |    5006 |  214 |   23.39 | 1.64e-04 | 1.20e-02 ||    4.41 |    0.33 |    21.15 | 1415.36 | 1179.70 |   23.15 | 00h00'05    4.00 |   20112 |    5681 |  240 |   23.67 | 1.65e-04 | 1.19e-02 ||    4.96 |    0.37 |    23.78 | 1414.79 | 1179.22 |   23.16 | 00h00'04 *  4.00 |   22352 |    6410 |  269 |   23.83 | 1.68e-04 | 1.20e-02 ||    5.51 |    0.41 |    26.42 | 1415.48 | 1179.80 |   23.15 | 00h00'04 *  4.00 |   24592 |    6932 |  293 |   23.66 | 1.65e-04 | 1.19e-02 ||    6.06 |    0.45 |    29.07 | 1415.48 | 1179.80 |   23.15 | 00h00'03    4.00 |   26832 |    7274 |  311 |   23.39 | 1.59e-04 | 1.16e-02 ||    6.62 |    0.49 |    31.71 | 1415.88 | 1180.13 |   23.14 | 00h00'03    4.00 |   29072 |    7665 |  336 |   22.81 | 1.54e-04 | 1.16e-02 ||    7.17 |    0.53 |    34.36 | 1415.79 | 1180.06 |   23.14 | 00h00'03 *  4.00 |   31312 |    8465 |  367 |   23.07 | 1.58e-04 | 1.17e-02 ||    7.72 |    0.57 |    37.00 | 1416.06 | 1180.28 |   23.14 | 00h00'02 *  4.00 |   33536 |    9263 |  397 |   23.33 | 1.62e-04 | 1.18e-02 ||    8.27 |    0.61 |    39.63 | 1415.77 | 1180.03 |   23.15 | 00h00'01    4.00 |   35776 |   10098 |  430 |   23.48 | 1.65e-04 | 1.20e-02 ||    8.82 |    0.65 |    42.28 | 1415.75 | 1180.02 |   23.15 | 00h00'01    4.00 |   37984 |   10794 |  462 |   23.36 | 1.66e-04 | 1.22e-02 ||    9.37 |    0.69 |    44.92 | 1414.82 | 1179.25 |   23.16 | 00h00'00 *  4.00 |   40224 |   11371 |  494 |   23.02 | 1.66e-04 | 1.23e-02 ||    9.92 |    0.73 |    47.56 | 1415.02 | 1179.41 |   23.16 | 00h00'00 *  4.00 |   40864 |   11465 |  500 |   22.93 | 1.64e-04 | 1.22e-02 ||   10.08 |    0.74 |    48.32 | 1414.98 | 1179.38 |   23.16 | 00h00'09  
# End of the simulation.
