<?xml version="1.0" ?>
<sdf version="1.4">
  <world name="default">
    <!-- A gazebo links attacher -->
    <plugin name="ros_link_attacher_plugin" filename="libdual_panda_setup.so"/>
    <include>
      <uri>model://sun</uri>
    </include>
    <!-- A ground plane -->
    <include>
      <uri>model://ground_plane</uri>
    </include>
  </world>
</sdf>
