<robot name="onshape">


    <link name="world"/>

    <joint name="world_to_base" type="fixed">
      <origin rpy="-1.57078 0 0" xyz="0 0 0"/> 
      <parent link="world"/>
      <child link="base"/>
    </joint>


<link name="base">
<visual>
<origin xyz="-0.023500007393561755942 -0.2809999999999993614 -0.11499996650994054326" rpy="-2.8102520310824269999e-16 -4.4408920985006281338e-16 1.5707963267948958919" />
<geometry>
<mesh filename="package:///base.stl"/>
</geometry>
<material name="base_material">
<color rgba="0.61568627450980395466 0.81176470588235294379 0.92941176470588238168 1.0"/>
</material>
</visual>
<collision>
<origin xyz="-0.023500007393561755942 -0.2809999999999993614 -0.11499996650994054326" rpy="-2.8102520310824269999e-16 -4.4408920985006281338e-16 1.5707963267948958919" />
<geometry>
<mesh filename="package:///base.stl"/>
</geometry>
</collision>
<visual>
<origin xyz="0 -0.010000000000000000208 0" rpy="1.1832913578315786646e-30 2.3665827156631573292e-30 -2.3665827156631573292e-30" />
<geometry>
<mesh filename="package:///201_020_-_45x45l-10.stl"/>
</geometry>
<material name="201_020_-_45x45l-10_material">
<color rgba="0.89019607843137249503 0.89019607843137249503 0.91372549019607840481 1.0"/>
</material>
</visual>
<collision>
<origin xyz="0 -0.010000000000000000208 0" rpy="1.1832913578315786646e-30 2.3665827156631573292e-30 -2.3665827156631573292e-30" />
<geometry>
<mesh filename="package:///201_020_-_45x45l-10.stl"/>
</geometry>
</collision>
<inertial>
<origin xyz="-1.3360989421361528184e-05 -0.15776868721640599502 -0.00071253667426573021396" rpy="0 0 0"/>
<mass value="1.4015699578415758975" />
<inertia ixx="0.011634458611578371579" ixy="-1.8884356660067900172e-06"  ixz="-4.8602934414281845802e-07" iyy="0.00056008966745273798711" iyz="-0.00010031359244638920179" izz="0.011616539838498918247" />
</inertial>
</link>

<link name="dc05_m01_dummy_arm2">
<visual>
<origin xyz="0.017300000000000006345 -0.040000000000000007772 -0.017000000000000001221" rpy="1.570796326794896558 1.0014835710810955211e-32 2.3111159332635160048e-32" />
<geometry>
<mesh filename="package:///dc05_m01_dummy_arm2.stl"/>
</geometry>
<material name="dc05_m01_dummy_arm2_material">
<color rgba="0.49803921568627451677 0.49803921568627451677 0.49803921568627451677 1.0"/>
</material>
</visual>
<collision>
<origin xyz="0.017300000000000006345 -0.040000000000000007772 -0.017000000000000001221" rpy="1.570796326794896558 1.0014835710810955211e-32 2.3111159332635160048e-32" />
<geometry>
<mesh filename="package:///dc05_m01_dummy_arm2.stl"/>
</geometry>
</collision>
<inertial>
<origin xyz="0.017300007921980237874 -0.024488208862426044665 -0.016902537823883973661" rpy="0 0 0"/>
<mass value="0.13500000000000003664" />
<inertia ixx="5.4645145060838845575e-05" ixy="-3.9703679266637605779e-11"  ixz="1.8940461969531348001e-11" iyy="3.0817511616687728838e-05" iyz="-7.5428129097330123002e-07" izz="4.6367590893970518087e-05" />
</inertial>
</link>

<link name="hn05_n102_arm2">
<visual>
<origin xyz="0 0 0.0031000000000000055289" rpy="-3.141592653589793116 -1.0159413866354923764e-44 -6.8825963043900546778e-32" />
<geometry>
<mesh filename="package:///hn05_n102_arm2.stl"/>
</geometry>
<material name="hn05_n102_arm2_material">
<color rgba="0.27843137254901961786 0.27843137254901961786 0.27843137254901961786 1.0"/>
</material>
</visual>
<collision>
<origin xyz="0 0 0.0031000000000000055289" rpy="-3.141592653589793116 -1.0159413866354923764e-44 -6.8825963043900546778e-32" />
<geometry>
<mesh filename="package:///hn05_n102_arm2.stl"/>
</geometry>
</collision>
<inertial>
<origin xyz="-9.4250594571230977377e-13 7.5619680159674063833e-09 0.001713461934074635238" rpy="0 0 0"/>
<mass value="0.011333274658960196257" />
<inertia ixx="5.6313891689428879363e-07" ixy="1.052458219875223033e-16"  ixz="-3.7636878525141773581e-44" iyy="5.6315003899108084174e-07" iyz="-3.5591998511182540143e-12" izz="1.1063837443946260993e-06" />
</inertial>
</link>

<link name="enrouleurcablelarge">
<visual>
<origin xyz="-0.007778174593052020365 0.007778174593052022967 0" rpy="1.570796326794896558 -3.9443045261050590271e-31 -6.5319847294324632983e-32" />
<geometry>
<mesh filename="package:///enrouleurcablelarge.stl"/>
</geometry>
<material name="enrouleurcablelarge_material">
<color rgba="0.61568627450980395466 0.81176470588235294379 0.92941176470588238168 1.0"/>
</material>
</visual>
<collision>
<origin xyz="-0.007778174593052020365 0.007778174593052022967 0" rpy="1.570796326794896558 -3.9443045261050590271e-31 -6.5319847294324632983e-32" />
<geometry>
<mesh filename="package:///enrouleurcablelarge.stl"/>
</geometry>
</collision>
<inertial>
<origin xyz="-0.0077860008126189031094 0.0077800512492307814794 -0.012959176487737561478" rpy="0 0 0"/>
<mass value="0.090659295511557297376" />
<inertia ixx="6.6516025066416483423e-05" ixy="-1.4348787998924937378e-12"  ixz="3.2585046305566887418e-10" iyy="6.6513663675007764198e-05" iyz="-4.6086216142423782585e-10" izz="0.00012306392711541839645" />
</inertial>
</link>

<link name="arm_1">
<visual>
<origin xyz="0.022999999999999999611 0 -0.115000000000000005" rpy="-1.570796326794896558 -1.570796326794896558 0" />
<geometry>
<mesh filename="package:///arm_1.stl"/>
</geometry>
<material name="arm_1_material">
<color rgba="0.61568627450980395466 0.81176470588235294379 0.92941176470588238168 1.0"/>
</material>
</visual>
<collision>
<origin xyz="0.022999999999999999611 0 -0.115000000000000005" rpy="-1.570796326794896558 -1.570796326794896558 0" />
<geometry>
<mesh filename="package:///arm_1.stl"/>
</geometry>
</collision>
<inertial>
<origin xyz="1.0408340855860751663e-17 0.099119815547588085991 -0.028167447274392094086" rpy="0 0 0"/>
<mass value="0.14226883307096552245" />
<inertia ixx="0.00062540658957354244765" ixy="-2.8152634687778396944e-34"  ixz="-2.4845777232889448901e-34" iyy="0.00019686517047370758523" iyz="0.00019129660021336108815" izz="0.00048153180186425744271" />
</inertial>
</link>

<link name="dc05_m01_dummy_arm2_2">
<visual>
<origin xyz="-0.017299999999999995937 0.0040000000000000313083 -0.017000000000000015099" rpy="1.570796326794896558 2.0318335151999337518e-32 0" />
<geometry>
<mesh filename="package:///dc05_m01_dummy_arm2.stl"/>
</geometry>
<material name="dc05_m01_dummy_arm2_material">
<color rgba="0.49803921568627451677 0.49803921568627451677 0.49803921568627451677 1.0"/>
</material>
</visual>
<collision>
<origin xyz="-0.017299999999999995937 0.0040000000000000313083 -0.017000000000000015099" rpy="1.570796326794896558 2.0318335151999337518e-32 0" />
<geometry>
<mesh filename="package:///dc05_m01_dummy_arm2.stl"/>
</geometry>
</collision>
<inertial>
<origin xyz="-0.017299992078019764408 0.019511791137573994415 -0.016902537823883987539" rpy="0 0 0"/>
<mass value="0.13500000000000003664" />
<inertia ixx="5.4645145060838845575e-05" ixy="-3.9703679266637605779e-11"  ixz="1.8940461969531348001e-11" iyy="3.0817511616687728838e-05" iyz="-7.5428129097330123002e-07" izz="4.6367590893970518087e-05" />
</inertial>
</link>

<link name="hn05_n102_arm2_2">
<visual>
<origin xyz="1.084202172485504434e-19 0 -0.000800000000000022915" rpy="3.141592653589793116 -5.2329238336184951072e-32 0" />
<geometry>
<mesh filename="package:///hn05_n102_arm2.stl"/>
</geometry>
<material name="hn05_n102_arm2_material">
<color rgba="0.27843137254901961786 0.27843137254901961786 0.27843137254901961786 1.0"/>
</material>
</visual>
<collision>
<origin xyz="1.084202172485504434e-19 0 -0.000800000000000022915" rpy="3.141592653589793116 -5.2329238336184951072e-32 0" />
<geometry>
<mesh filename="package:///hn05_n102_arm2.stl"/>
</geometry>
</collision>
<inertial>
<origin xyz="-9.4250583729209252522e-13 7.5619680159674063833e-09 -0.0021865380659253932059" rpy="0 0 0"/>
<mass value="0.011333274658960196257" />
<inertia ixx="5.6313891689428879363e-07" ixy="1.052458219875223033e-16"  ixz="-1.4785283031137312253e-38" iyy="5.6315003899108084174e-07" iyz="-3.5591998511182540143e-12" izz="1.1063837443946260993e-06" />
</inertial>
</link>

<link name="enrouleurcable">
<visual>
<origin xyz="0 0 0" rpy="1.570796326794896558 1.4098026090568171718e-31 8.8242615703073250101e-32" />
<geometry>
<mesh filename="package:///enrouleurcable.stl"/>
</geometry>
<material name="enrouleurcable_material">
<color rgba="0.61568627450980395466 0.81176470588235294379 0.92941176470588238168 1.0"/>
</material>
</visual>
<collision>
<origin xyz="0 0 0" rpy="1.570796326794896558 1.4098026090568171718e-31 8.8242615703073250101e-32" />
<geometry>
<mesh filename="package:///enrouleurcable.stl"/>
</geometry>
</collision>
<inertial>
<origin xyz="-1.3026320457968350192e-05 3.1235930151220220957e-06 -0.0092775980401585706608" rpy="0 0 0"/>
<mass value="0.054468148142202854611" />
<inertia ixx="2.0320448779208614368e-05" ixy="-2.319604852316881908e-12"  ixz="-2.2863014293886723908e-09" iyy="2.0318083910375912154e-05" iyz="1.6550807351552483107e-10" izz="3.4467994453516286328e-05" />
</inertial>
</link>

<link name="arm_2">
<visual>
<origin xyz="0.02300000000000000655 -0.0079999999999999793499 -0.092500000000000026645" rpy="-1.570796326794896558 -1.570796326794896558 0" />
<geometry>
<mesh filename="package:///arm_2.stl"/>
</geometry>
<material name="arm_2_material">
<color rgba="0.61568627450980395466 0.81176470588235294379 0.92941176470588238168 1.0"/>
</material>
</visual>
<collision>
<origin xyz="0.02300000000000000655 -0.0079999999999999793499 -0.092500000000000026645" rpy="-1.570796326794896558 -1.570796326794896558 0" />
<geometry>
<mesh filename="package:///arm_2.stl"/>
</geometry>
</collision>
<inertial>
<origin xyz="3.4694469519536149592e-18 0.048771037072532191781 -0.026988549622504451331" rpy="0 0 0"/>
<mass value="0.094122339504329285975" />
<inertia ixx="0.00018851917784674896718" ixy="7.103133700846349575e-37"  ixz="3.4720527327390673536e-36" iyy="0.00010187075824849519984" iyz="6.363157909489654848e-05" izz="0.00012251565186333692467" />
</inertial>
</link>

<link name="dc05_m01_dummy_arm2_3">
<visual>
<origin xyz="0.017300000000000002875 -0.040000000000000035527 -0.015749999999999986233" rpy="1.570796326794896558 -1.9168064809766821642e-32 -2.1983008427325899985e-31" />
<geometry>
<mesh filename="package:///dc05_m01_dummy_arm2.stl"/>
</geometry>
<material name="dc05_m01_dummy_arm2_material">
<color rgba="0.49803921568627451677 0.49803921568627451677 0.49803921568627451677 1.0"/>
</material>
</visual>
<collision>
<origin xyz="0.017300000000000002875 -0.040000000000000035527 -0.015749999999999986233" rpy="1.570796326794896558 -1.9168064809766821642e-32 -2.1983008427325899985e-31" />
<geometry>
<mesh filename="package:///dc05_m01_dummy_arm2.stl"/>
</geometry>
</collision>
<inertial>
<origin xyz="0.017300007921980234404 -0.024488208862426072421 -0.015652537823883958673" rpy="0 0 0"/>
<mass value="0.13500000000000003664" />
<inertia ixx="5.4645145060838845575e-05" ixy="-3.9703679266637605779e-11"  ixz="1.8940461969531348001e-11" iyy="3.0817511616687728838e-05" iyz="-7.5428129097330123002e-07" izz="4.6367590893970518087e-05" />
</inertial>
</link>

<link name="hn05_n102_arm2_3">
<visual>
<origin xyz="6.505213034913026604e-19 0 0.0031000000000000194067" rpy="-3.141592653589793116 -6.6502157982930123709e-32 7.5912444058361715494e-33" />
<geometry>
<mesh filename="package:///hn05_n102_arm2.stl"/>
</geometry>
<material name="hn05_n102_arm2_material">
<color rgba="0.27843137254901961786 0.27843137254901961786 0.27843137254901961786 1.0"/>
</material>
</visual>
<collision>
<origin xyz="6.505213034913026604e-19 0 0.0031000000000000194067" rpy="-3.141592653589793116 -6.6502157982930123709e-32 7.5912444058361715494e-33" />
<geometry>
<mesh filename="package:///hn05_n102_arm2.stl"/>
</geometry>
</collision>
<inertial>
<origin xyz="-9.4250529519100628247e-13 7.5619680159674063833e-09 0.0017134619340746491158" rpy="0 0 0"/>
<mass value="0.011333274658960196257" />
<inertia ixx="5.6313891689428879363e-07" ixy="1.052458219875223033e-16"  ixz="1.6884448178313661939e-37" iyy="5.6315003899108084174e-07" iyz="-3.5591998511182540143e-12" izz="1.1063837443946260993e-06" />
</inertial>
</link>

<link name="support_vial">
<visual>
<origin xyz="0 0 0" rpy="1.570796326794896558 1.570796326794896558 0" />
<geometry>
<mesh filename="package:///support_vial.stl"/>
</geometry>
<material name="support_vial_material">
<color rgba="0.61568627450980395466 0.81176470588235294379 0.92941176470588238168 1.0"/>
</material>
</visual>
<collision>
<origin xyz="0 0 0" rpy="1.570796326794896558 1.570796326794896558 0" />
<geometry>
<mesh filename="package:///support_vial.stl"/>
</geometry>
</collision>
<inertial>
<origin xyz="-5.7038675750888004172e-05 3.5276598188530894123e-05 -0.0081761639840888002129" rpy="0 0 0"/>
<mass value="0.0089055620967962729334" />
<inertia ixx="7.9954892783500164649e-07" ixy="-1.7892147175828804516e-11"  ixz="-3.4662976620086619465e-09" iyy="7.9614835180684498524e-07" iyz="-9.978220440402263512e-10" izz="1.037271680951452816e-06" />
</inertial>
</link>

<link name="vial">
<visual>
<origin xyz="0 0 0" rpy="1.570796326794896558 1.570796326794896558 0" />
<geometry>
<mesh filename="package:///vial.stl"/>
</geometry>
<material name="vial_material">
<color rgba="0.61568627450980395466 0.81176470588235294379 0.92941176470588238168 1.0"/>
</material>
</visual>
<collision>
<origin xyz="0 0 0" rpy="1.570796326794896558 1.570796326794896558 0" />
<geometry>
<mesh filename="package:///vial.stl"/>
</geometry>
</collision>
<inertial>
<origin xyz="-5.9191660172233133746e-32 -4.8035818808752511227e-19 -0.031600805728548453377" rpy="0 0 0"/>
<mass value="0.035529502823767177" />
<inertia ixx="1.3000378227502317618e-05" ixy="2.5539250771629256126e-36"  ixz="1.1101533982176868648e-36" iyy="1.3000378227502317618e-05" iyz="5.8922872582910068878e-35" izz="1.2598893784619815181e-06" />
</inertial>
</link>

 <link name="mid_vial"/>

<!-- axe Y dans le prolongement de la fiole et axe Z dans le prolongement 
de la normale au trou de la vis de maintien (pour équivalence avec plan caméra) -->
<!-- <joint name="mid_vial_to_vial_eq_cam" type="fixed">
  <origin xyz="0 0 -27e-3" rpy="-1.570796326794896558 0 3.141592653589793116" />
  <parent link="vial" />
  <child link="mid_vial" />

</joint> -->


<!--  axe Z dans le prolongement de la fiole et axe X dans le prolongement 
de la normale au trou de la vis de maintien (eq EE panda) -->
<joint name="mid_vial_to_vial_eq_panda" type="fixed">
  <origin xyz="0 0 -27e-3" rpy="-3.141592653589793116 0 0" />
  <parent link="vial" />
  <child link="mid_vial" />

</joint>


<joint name="vial_to_support" type="fixed">
<origin xyz="-1.084202172485504434e-19 0 -0.010000000000000008882" rpy="-1.6708224036199624745e-14 -9.7288248062668720681e-15 1.570796326794896558" />
<parent link="support_vial" />
<child link="vial" />
<axis xyz="0 0 1"/>
<limit effort="1" velocity="20" />
<joint_properties friction="0.0"/>
</joint>

<joint name="support_to_servo2" type="fixed">
<origin xyz="6.505213034913026604e-19 0 0.00060000000000004494183" rpy="4.3932836189762238183e-15 -3.6805576527934720575e-15 -2.5816922035048247106e-30" />
<parent link="hn05_n102_arm2_3" />
<child link="support_vial" />
<axis xyz="0 0 1"/>
<limit effort="1" velocity="20" />
<joint_properties friction="0.0"/>
</joint>

<joint name="gimbal_joint3" type="revolute">
<origin xyz="0.017300000000000002875 -0.040000000000000035527 -0.040150000000000019007" rpy="-4.3932836189761812198e-15 2.6284473422633934273e-16 -7.1121173934285691214e-15" />
<parent link="dc05_m01_dummy_arm2_3" />
<child link="hn05_n102_arm2_3" />
<axis xyz="0 0 1"/>
<limit effort="1" velocity="20" lower="-9.424777960769379348" upper="9.424777960769379348"/>
<joint_properties friction="0.0"/>
</joint>

<joint name="servo2_to_arm2" type="fixed">
<origin xyz="0.017300000000000002875 0.07450000000000012168 -0.052499999999999935607" rpy="1.570796326794896558 8.9112651350198920659e-31 -3.1415926535897895633" />
<parent link="arm_2" />
<child link="dc05_m01_dummy_arm2_3" />
<axis xyz="0 0 1"/>
<limit effort="1" velocity="20" />
<joint_properties friction="0.0"/>
</joint>

<joint name="arm2_to_enroul" type="fixed">
<origin xyz="2.168404344971008868e-18 -0.0079999999999999793499 -0.020500000000000018208" rpy="7.3711154696250786518e-15 2.7469151421829730399e-29 -3.141592653589793116" />
<parent link="enrouleurcable" />
<child link="arm_2" />
<axis xyz="0 0 1"/>
<limit effort="1" velocity="20" />
<joint_properties friction="0.0"/>
</joint>

<joint name="enroul_to_servo1" type="fixed">
<origin xyz="1.084202172485504434e-19 0 -0.0033000000000000251354" rpy="7.4776869841633317375e-15 -2.8727020762175909706e-15 -7.8886090522101110476e-31" />
<parent link="hn05_n102_arm2_2" />
<child link="enrouleurcable" />
<axis xyz="0 0 1"/>
<limit effort="1" velocity="20" />
<joint_properties friction="0.0"/>
</joint>

<joint name="gimbal_joint2" type="revolute">
<origin xyz="-0.017300000000001047179 0.0040000000000000313083 -0.037500000000000088818" rpy="-1.0657151453805611698e-16 5.600886738454001666e-17 3.1415926535897900074" />
<parent link="dc05_m01_dummy_arm2_2" />
<child link="hn05_n102_arm2_2" />
<axis xyz="0 0 1"/>
<limit effort="1" velocity="20" lower="-3.141592653589793116" upper="3.141592653589793116"/>
<joint_properties friction="0.0"/>
</joint>

<joint name="servo1_to_arm1" type="fixed">
<origin xyz="-0.017299999999999999406 0.15350000000000008082 -0.11900000000000000855" rpy="1.570796326794896558 -3.2441889904961006594e-31 -3.141592653589793116" />
<parent link="arm_1" />
<child link="dc05_m01_dummy_arm2_2" />
<axis xyz="0 0 1"/>
<limit effort="1" velocity="20" />
<joint_properties friction="0.0"/>
</joint>

<joint name="arm1_to_gdEnroul" type="fixed">
<origin xyz="-0.0077781745930520212323 0.0077781745930519674559 -0.02050000000000000433" rpy="4.9080004939958691967e-15 2.1203015088640287439e-15 -3.141592653589793116" />
<parent link="enrouleurcablelarge" />
<child link="arm_1" />
<axis xyz="0 0 1"/>
<limit effort="1" velocity="20" />
<joint_properties friction="0.0"/>
</joint>

<joint name="gdEnroul_to_servo0" type="fixed">
<origin xyz="-0.007778174593052022967 -0.0077781745930519978136 0.00060000000000000330846" rpy="1.7065391272594988685e-17 1.1316963334740982303e-31 -1.570796326794896558" />
<parent link="hn05_n102_arm2" />
<child link="enrouleurcablelarge" />
<axis xyz="0 0 1"/>
<limit effort="1" velocity="20" />
<joint_properties friction="0.0"/>
</joint>

<joint name="gimbal_joint1" type="revolute">
<origin xyz="0.017300000000000131245 -0.040000000000000618394 -0.041400000000000082567" rpy="2.5670527610815524283e-15 -4.1391934504730643887e-15 1.5707963267948907848" />
<parent link="dc05_m01_dummy_arm2" />
<child link="hn05_n102_arm2" />
<axis xyz="0 0 1"/>
<limit effort="1" velocity="20" lower="-6.283185307179586232" upper="6.283185307179586232"/>
<joint_properties friction="0.0"/>
</joint>

<joint name="servo0_to_base" type="fixed">
<origin xyz="-0.017800007393561745328 -0.24099999999999943689 -0.03249996650994092795" rpy="-4.5832826603230962393e-15 -2.8102520310824329164e-16 6.6613381477509648805e-16" />
<parent link="base" />
<child link="dc05_m01_dummy_arm2" />
<axis xyz="0 0 1"/>
<limit effort="1" velocity="20" />
<joint_properties friction="0.0"/>
</joint>


</robot>
