%YAML 1.1
%TAG !u! tag:unity3d.com,2011:
--- !u!114 &11400000
MonoBehaviour:
  m_ObjectHideFlags: 0
  m_CorrespondingSourceObject: {fileID: 0}
  m_PrefabInstance: {fileID: 0}
  m_PrefabAsset: {fileID: 0}
  m_GameObject: {fileID: 0}
  m_Enabled: 1
  m_EditorHideFlags: 0
  m_Script: {fileID: 11500000, guid: 5116417a614f44321b9dd939cff73583, type: 3}
  m_Name: PointCloudVisualizerSettings
  m_EditorClassIdentifier: 
  m_TFTrackingSettings:
    type: 2
    tfTopic: /tf
  m_ColorMode: 2
