Linked: (/home/anqiu/ros_ws/panda_teleop_ws/devel/.private/panda_motion/share/panda_motion/cmake/panda_motionConfig-version.cmake, /home/anqiu/ros_ws/panda_teleop_ws/devel/share/panda_motion/cmake/panda_motionConfig-version.cmake)
Linked: (/home/anqiu/ros_ws/panda_teleop_ws/devel/.private/panda_motion/share/panda_motion/cmake/panda_motionConfig.cmake, /home/anqiu/ros_ws/panda_teleop_ws/devel/share/panda_motion/cmake/panda_motionConfig.cmake)
Linked: (/home/anqiu/ros_ws/panda_teleop_ws/devel/.private/panda_motion/lib/pkgconfig/panda_motion.pc, /home/anqiu/ros_ws/panda_teleop_ws/devel/lib/pkgconfig/panda_motion.pc)
Linked: (/home/anqiu/ros_ws/panda_teleop_ws/devel/.private/panda_motion/lib/python3/dist-packages/panda_motion/__init__.py, /home/anqiu/ros_ws/panda_teleop_ws/devel/lib/python3/dist-packages/panda_motion/__init__.py)
Linked: (/home/anqiu/ros_ws/panda_teleop_ws/devel/.private/panda_motion/lib/panda_motion/cmake.lock, /home/anqiu/ros_ws/panda_teleop_ws/devel/lib/panda_motion/cmake.lock)
Linked: (/home/anqiu/ros_ws/panda_teleop_ws/devel/.private/panda_motion/lib/panda_motion/go_home.py, /home/anqiu/ros_ws/panda_teleop_ws/devel/lib/panda_motion/go_home.py)
Linked: (/home/anqiu/ros_ws/panda_teleop_ws/devel/.private/panda_motion/lib/panda_motion/example.py, /home/anqiu/ros_ws/panda_teleop_ws/devel/lib/panda_motion/example.py)
