[01m[K/home/anqiu/ros_ws/panda_teleop_ws/src/ros_haptic_teleop/src/teleop.cpp:[m[K In member function ‘[01m[Kvoid teleop::Teleop::update()[m[K’:
[01m[K/home/anqiu/ros_ws/panda_teleop_ws/src/ros_haptic_teleop/src/teleop.cpp:893:28:[m[K [01;31m[Kerror: [m[Kredeclaration of ‘[01m[Kdouble decay_factor[m[K’
  893 |                     double [01;31m[Kdecay_factor[m[K = 1.0 - 1.0 / (1.0 + exp(-k * (t - t0)));
      |                            [01;31m[K^~~~~~~~~~~~[m[K
[01m[K/home/anqiu/ros_ws/panda_teleop_ws/src/ros_haptic_teleop/src/teleop.cpp:892:28:[m[K [01;36m[Knote: [m[K‘[01m[Kdouble decay_factor[m[K’ previously declared here
  892 |                     double [01;36m[Kdecay_factor[m[K = exp(-t / tau);
      |                            [01;36m[K^~~~~~~~~~~~[m[K
make[2]: *** [CMakeFiles/ros_haptic_teleop.dir/build.make:76: CMakeFiles/ros_haptic_teleop.dir/src/teleop.cpp.o] Error 1
make[1]: *** [CMakeFiles/Makefile2:424: CMakeFiles/ros_haptic_teleop.dir/all] Error 2
make: *** [Makefile:141: all] Error 2
