[01m[K/home/anqiu/ros_ws/panda_teleop_ws/src/ros_haptic_teleop/src/teleop.cpp:[m[K In member function ‘[01m[Kvoid teleop::Teleop::update()[m[K’:
[01m[K/home/anqiu/ros_ws/panda_teleop_ws/src/ros_haptic_teleop/src/teleop.cpp:886:23:[m[K [01;31m[Kerror: [m[K‘[01m[Kinitial_force[m[K’ was not declared in this scope; did you mean ‘[01m[Kadditional_force[m[K’?
  886 |                       [01;31m[Kinitial_force[m[K = des_F_h;
      |                       [01;31m[K^~~~~~~~~~~~~[m[K
      |                       [32m[Kadditional_force[m[K
[01m[K/home/anqiu/ros_ws/panda_teleop_ws/src/ros_haptic_teleop/src/teleop.cpp:901:58:[m[K [01;31m[Kerror: [m[K‘[01m[Kinitial_force[m[K’ was not declared in this scope; did you mean ‘[01m[Kadditional_force[m[K’?
  901 |                     double force_error_norm = (des_F_h - [01;31m[Kinitial_force[m[K).norm();
      |                                                          [01;31m[K^~~~~~~~~~~~~[m[K
      |                                                          [32m[Kadditional_force[m[K
make[2]: *** [CMakeFiles/ros_haptic_teleop.dir/build.make:76: CMakeFiles/ros_haptic_teleop.dir/src/teleop.cpp.o] Error 1
make[1]: *** [CMakeFiles/Makefile2:424: CMakeFiles/ros_haptic_teleop.dir/all] Error 2
make: *** [Makefile:141: all] Error 2
