Linked: (/home/anqiu/ros_ws/panda_teleop_ws/devel/.private/franka_example_controllers/share/franka_example_controllers/cmake/franka_example_controllersConfig-version.cmake, /home/anqiu/ros_ws/panda_teleop_ws/devel/share/franka_example_controllers/cmake/franka_example_controllersConfig-version.cmake)
Linked: (/home/anqiu/ros_ws/panda_teleop_ws/devel/.private/franka_example_controllers/share/franka_example_controllers/cmake/franka_example_controllersConfig.cmake, /home/anqiu/ros_ws/panda_teleop_ws/devel/share/franka_example_controllers/cmake/franka_example_controllersConfig.cmake)
Linked: (/home/anqiu/ros_ws/panda_teleop_ws/devel/.private/franka_example_controllers/share/franka_example_controllers/cmake/franka_example_controllers-msg-extras.cmake, /home/anqiu/ros_ws/panda_teleop_ws/devel/share/franka_example_controllers/cmake/franka_example_controllers-msg-extras.cmake)
Linked: (/home/anqiu/ros_ws/panda_teleop_ws/devel/.private/franka_example_controllers/share/franka_example_controllers/cmake/franka_example_controllers-msg-paths.cmake, /home/anqiu/ros_ws/panda_teleop_ws/devel/share/franka_example_controllers/cmake/franka_example_controllers-msg-paths.cmake)
Linked: (/home/anqiu/ros_ws/panda_teleop_ws/devel/.private/franka_example_controllers/share/franka_example_controllers/docs/dual_arm_compliance_paramConfig.dox, /home/anqiu/ros_ws/panda_teleop_ws/devel/share/franka_example_controllers/docs/dual_arm_compliance_paramConfig.dox)
Linked: (/home/anqiu/ros_ws/panda_teleop_ws/devel/.private/franka_example_controllers/share/franka_example_controllers/docs/dual_arm_compliance_paramConfig-usage.dox, /home/anqiu/ros_ws/panda_teleop_ws/devel/share/franka_example_controllers/docs/dual_arm_compliance_paramConfig-usage.dox)
Linked: (/home/anqiu/ros_ws/panda_teleop_ws/devel/.private/franka_example_controllers/share/franka_example_controllers/docs/desired_mass_paramConfig.wikidoc, /home/anqiu/ros_ws/panda_teleop_ws/devel/share/franka_example_controllers/docs/desired_mass_paramConfig.wikidoc)
Linked: (/home/anqiu/ros_ws/panda_teleop_ws/devel/.private/franka_example_controllers/share/franka_example_controllers/docs/compliance_paramConfig.dox, /home/anqiu/ros_ws/panda_teleop_ws/devel/share/franka_example_controllers/docs/compliance_paramConfig.dox)
Linked: (/home/anqiu/ros_ws/panda_teleop_ws/devel/.private/franka_example_controllers/share/franka_example_controllers/docs/teleop_paramConfig.wikidoc, /home/anqiu/ros_ws/panda_teleop_ws/devel/share/franka_example_controllers/docs/teleop_paramConfig.wikidoc)
Linked: (/home/anqiu/ros_ws/panda_teleop_ws/devel/.private/franka_example_controllers/share/franka_example_controllers/docs/dual_arm_compliance_paramConfig.wikidoc, /home/anqiu/ros_ws/panda_teleop_ws/devel/share/franka_example_controllers/docs/dual_arm_compliance_paramConfig.wikidoc)
Linked: (/home/anqiu/ros_ws/panda_teleop_ws/devel/.private/franka_example_controllers/share/franka_example_controllers/docs/teleop_gripper_paramConfig.dox, /home/anqiu/ros_ws/panda_teleop_ws/devel/share/franka_example_controllers/docs/teleop_gripper_paramConfig.dox)
Linked: (/home/anqiu/ros_ws/panda_teleop_ws/devel/.private/franka_example_controllers/share/franka_example_controllers/docs/teleop_gripper_paramConfig.wikidoc, /home/anqiu/ros_ws/panda_teleop_ws/devel/share/franka_example_controllers/docs/teleop_gripper_paramConfig.wikidoc)
Linked: (/home/anqiu/ros_ws/panda_teleop_ws/devel/.private/franka_example_controllers/share/franka_example_controllers/docs/teleop_paramConfig.dox, /home/anqiu/ros_ws/panda_teleop_ws/devel/share/franka_example_controllers/docs/teleop_paramConfig.dox)
Linked: (/home/anqiu/ros_ws/panda_teleop_ws/devel/.private/franka_example_controllers/share/franka_example_controllers/docs/desired_mass_paramConfig-usage.dox, /home/anqiu/ros_ws/panda_teleop_ws/devel/share/franka_example_controllers/docs/desired_mass_paramConfig-usage.dox)
Linked: (/home/anqiu/ros_ws/panda_teleop_ws/devel/.private/franka_example_controllers/share/franka_example_controllers/docs/compliance_paramConfig.wikidoc, /home/anqiu/ros_ws/panda_teleop_ws/devel/share/franka_example_controllers/docs/compliance_paramConfig.wikidoc)
Linked: (/home/anqiu/ros_ws/panda_teleop_ws/devel/.private/franka_example_controllers/share/franka_example_controllers/docs/teleop_paramConfig-usage.dox, /home/anqiu/ros_ws/panda_teleop_ws/devel/share/franka_example_controllers/docs/teleop_paramConfig-usage.dox)
Linked: (/home/anqiu/ros_ws/panda_teleop_ws/devel/.private/franka_example_controllers/share/franka_example_controllers/docs/compliance_paramConfig-usage.dox, /home/anqiu/ros_ws/panda_teleop_ws/devel/share/franka_example_controllers/docs/compliance_paramConfig-usage.dox)
Linked: (/home/anqiu/ros_ws/panda_teleop_ws/devel/.private/franka_example_controllers/share/franka_example_controllers/docs/teleop_gripper_paramConfig-usage.dox, /home/anqiu/ros_ws/panda_teleop_ws/devel/share/franka_example_controllers/docs/teleop_gripper_paramConfig-usage.dox)
Linked: (/home/anqiu/ros_ws/panda_teleop_ws/devel/.private/franka_example_controllers/share/franka_example_controllers/docs/desired_mass_paramConfig.dox, /home/anqiu/ros_ws/panda_teleop_ws/devel/share/franka_example_controllers/docs/desired_mass_paramConfig.dox)
Linked: (/home/anqiu/ros_ws/panda_teleop_ws/devel/.private/franka_example_controllers/share/common-lisp/ros/franka_example_controllers/msg/_package_JointTorqueComparison.lisp, /home/anqiu/ros_ws/panda_teleop_ws/devel/share/common-lisp/ros/franka_example_controllers/msg/_package_JointTorqueComparison.lisp)
Linked: (/home/anqiu/ros_ws/panda_teleop_ws/devel/.private/franka_example_controllers/share/common-lisp/ros/franka_example_controllers/msg/JointTorqueComparison.lisp, /home/anqiu/ros_ws/panda_teleop_ws/devel/share/common-lisp/ros/franka_example_controllers/msg/JointTorqueComparison.lisp)
Linked: (/home/anqiu/ros_ws/panda_teleop_ws/devel/.private/franka_example_controllers/share/common-lisp/ros/franka_example_controllers/msg/_package.lisp, /home/anqiu/ros_ws/panda_teleop_ws/devel/share/common-lisp/ros/franka_example_controllers/msg/_package.lisp)
Linked: (/home/anqiu/ros_ws/panda_teleop_ws/devel/.private/franka_example_controllers/share/common-lisp/ros/franka_example_controllers/msg/franka_example_controllers-msg.asd, /home/anqiu/ros_ws/panda_teleop_ws/devel/share/common-lisp/ros/franka_example_controllers/msg/franka_example_controllers-msg.asd)
Linked: (/home/anqiu/ros_ws/panda_teleop_ws/devel/.private/franka_example_controllers/share/gennodejs/ros/franka_example_controllers/_index.js, /home/anqiu/ros_ws/panda_teleop_ws/devel/share/gennodejs/ros/franka_example_controllers/_index.js)
Linked: (/home/anqiu/ros_ws/panda_teleop_ws/devel/.private/franka_example_controllers/share/gennodejs/ros/franka_example_controllers/msg/_index.js, /home/anqiu/ros_ws/panda_teleop_ws/devel/share/gennodejs/ros/franka_example_controllers/msg/_index.js)
Linked: (/home/anqiu/ros_ws/panda_teleop_ws/devel/.private/franka_example_controllers/share/gennodejs/ros/franka_example_controllers/msg/JointTorqueComparison.js, /home/anqiu/ros_ws/panda_teleop_ws/devel/share/gennodejs/ros/franka_example_controllers/msg/JointTorqueComparison.js)
Linked: (/home/anqiu/ros_ws/panda_teleop_ws/devel/.private/franka_example_controllers/share/roseus/ros/franka_example_controllers/manifest.l, /home/anqiu/ros_ws/panda_teleop_ws/devel/share/roseus/ros/franka_example_controllers/manifest.l)
Linked: (/home/anqiu/ros_ws/panda_teleop_ws/devel/.private/franka_example_controllers/share/roseus/ros/franka_example_controllers/msg/JointTorqueComparison.l, /home/anqiu/ros_ws/panda_teleop_ws/devel/share/roseus/ros/franka_example_controllers/msg/JointTorqueComparison.l)
Linked: (/home/anqiu/ros_ws/panda_teleop_ws/devel/.private/franka_example_controllers/lib/libfranka_example_controllers.so, /home/anqiu/ros_ws/panda_teleop_ws/devel/lib/libfranka_example_controllers.so)
Linked: (/home/anqiu/ros_ws/panda_teleop_ws/devel/.private/franka_example_controllers/lib/franka_example_controllers/dual_arm_interactive_marker.py, /home/anqiu/ros_ws/panda_teleop_ws/devel/lib/franka_example_controllers/dual_arm_interactive_marker.py)
Linked: (/home/anqiu/ros_ws/panda_teleop_ws/devel/.private/franka_example_controllers/lib/franka_example_controllers/interactive_marker.py, /home/anqiu/ros_ws/panda_teleop_ws/devel/lib/franka_example_controllers/interactive_marker.py)
Linked: (/home/anqiu/ros_ws/panda_teleop_ws/devel/.private/franka_example_controllers/lib/franka_example_controllers/cmake.lock, /home/anqiu/ros_ws/panda_teleop_ws/devel/lib/franka_example_controllers/cmake.lock)
Linked: (/home/anqiu/ros_ws/panda_teleop_ws/devel/.private/franka_example_controllers/lib/franka_example_controllers/move_to_start.py, /home/anqiu/ros_ws/panda_teleop_ws/devel/lib/franka_example_controllers/move_to_start.py)
Linked: (/home/anqiu/ros_ws/panda_teleop_ws/devel/.private/franka_example_controllers/lib/franka_example_controllers/teleop_gripper_node, /home/anqiu/ros_ws/panda_teleop_ws/devel/lib/franka_example_controllers/teleop_gripper_node)
Linked: (/home/anqiu/ros_ws/panda_teleop_ws/devel/.private/franka_example_controllers/lib/pkgconfig/franka_example_controllers.pc, /home/anqiu/ros_ws/panda_teleop_ws/devel/lib/pkgconfig/franka_example_controllers.pc)
Linked: (/home/anqiu/ros_ws/panda_teleop_ws/devel/.private/franka_example_controllers/lib/python3/dist-packages/franka_example_controllers/__init__.py, /home/anqiu/ros_ws/panda_teleop_ws/devel/lib/python3/dist-packages/franka_example_controllers/__init__.py)
Linked: (/home/anqiu/ros_ws/panda_teleop_ws/devel/.private/franka_example_controllers/lib/python3/dist-packages/franka_example_controllers/msg/_JointTorqueComparison.py, /home/anqiu/ros_ws/panda_teleop_ws/devel/lib/python3/dist-packages/franka_example_controllers/msg/_JointTorqueComparison.py)
Linked: (/home/anqiu/ros_ws/panda_teleop_ws/devel/.private/franka_example_controllers/lib/python3/dist-packages/franka_example_controllers/msg/__init__.py, /home/anqiu/ros_ws/panda_teleop_ws/devel/lib/python3/dist-packages/franka_example_controllers/msg/__init__.py)
Linked: (/home/anqiu/ros_ws/panda_teleop_ws/devel/.private/franka_example_controllers/lib/python3/dist-packages/franka_example_controllers/cfg/compliance_paramConfig.py, /home/anqiu/ros_ws/panda_teleop_ws/devel/lib/python3/dist-packages/franka_example_controllers/cfg/compliance_paramConfig.py)
Linked: (/home/anqiu/ros_ws/panda_teleop_ws/devel/.private/franka_example_controllers/lib/python3/dist-packages/franka_example_controllers/cfg/desired_mass_paramConfig.py, /home/anqiu/ros_ws/panda_teleop_ws/devel/lib/python3/dist-packages/franka_example_controllers/cfg/desired_mass_paramConfig.py)
Linked: (/home/anqiu/ros_ws/panda_teleop_ws/devel/.private/franka_example_controllers/lib/python3/dist-packages/franka_example_controllers/cfg/teleop_paramConfig.py, /home/anqiu/ros_ws/panda_teleop_ws/devel/lib/python3/dist-packages/franka_example_controllers/cfg/teleop_paramConfig.py)
Linked: (/home/anqiu/ros_ws/panda_teleop_ws/devel/.private/franka_example_controllers/lib/python3/dist-packages/franka_example_controllers/cfg/teleop_gripper_paramConfig.py, /home/anqiu/ros_ws/panda_teleop_ws/devel/lib/python3/dist-packages/franka_example_controllers/cfg/teleop_gripper_paramConfig.py)
Linked: (/home/anqiu/ros_ws/panda_teleop_ws/devel/.private/franka_example_controllers/lib/python3/dist-packages/franka_example_controllers/cfg/__init__.py, /home/anqiu/ros_ws/panda_teleop_ws/devel/lib/python3/dist-packages/franka_example_controllers/cfg/__init__.py)
Linked: (/home/anqiu/ros_ws/panda_teleop_ws/devel/.private/franka_example_controllers/lib/python3/dist-packages/franka_example_controllers/cfg/dual_arm_compliance_paramConfig.py, /home/anqiu/ros_ws/panda_teleop_ws/devel/lib/python3/dist-packages/franka_example_controllers/cfg/dual_arm_compliance_paramConfig.py)
Linked: (/home/anqiu/ros_ws/panda_teleop_ws/devel/.private/franka_example_controllers/include/franka_example_controllers/teleop_gripper_paramConfig.h, /home/anqiu/ros_ws/panda_teleop_ws/devel/include/franka_example_controllers/teleop_gripper_paramConfig.h)
Linked: (/home/anqiu/ros_ws/panda_teleop_ws/devel/.private/franka_example_controllers/include/franka_example_controllers/desired_mass_paramConfig.h, /home/anqiu/ros_ws/panda_teleop_ws/devel/include/franka_example_controllers/desired_mass_paramConfig.h)
Linked: (/home/anqiu/ros_ws/panda_teleop_ws/devel/.private/franka_example_controllers/include/franka_example_controllers/teleop_paramConfig.h, /home/anqiu/ros_ws/panda_teleop_ws/devel/include/franka_example_controllers/teleop_paramConfig.h)
Linked: (/home/anqiu/ros_ws/panda_teleop_ws/devel/.private/franka_example_controllers/include/franka_example_controllers/compliance_paramConfig.h, /home/anqiu/ros_ws/panda_teleop_ws/devel/include/franka_example_controllers/compliance_paramConfig.h)
Linked: (/home/anqiu/ros_ws/panda_teleop_ws/devel/.private/franka_example_controllers/include/franka_example_controllers/dual_arm_compliance_paramConfig.h, /home/anqiu/ros_ws/panda_teleop_ws/devel/include/franka_example_controllers/dual_arm_compliance_paramConfig.h)
Linked: (/home/anqiu/ros_ws/panda_teleop_ws/devel/.private/franka_example_controllers/include/franka_example_controllers/JointTorqueComparison.h, /home/anqiu/ros_ws/panda_teleop_ws/devel/include/franka_example_controllers/JointTorqueComparison.h)
