[  0%] Built target _franka_msgs_generate_messages_check_deps_SetCartesianImpedance
[  0%] Built target _franka_msgs_generate_messages_check_deps_SetJointImpedance
[  0%] Built target _franka_msgs_generate_messages_check_deps_SetFullCollisionBehavior
[  0%] Built target std_msgs_generate_messages_py
[  0%] Built target _franka_msgs_generate_messages_check_deps_ErrorRecoveryResult
[  0%] Built target _franka_msgs_generate_messages_check_deps_SetForceTorqueCollisionBehavior
[  0%] Built target _franka_msgs_generate_messages_check_deps_SetLoad
[  0%] Built target _franka_msgs_generate_messages_check_deps_SetKFrame
[  0%] Built target _franka_msgs_generate_messages_check_deps_ErrorRecoveryFeedback
[  0%] Built target _franka_msgs_generate_messages_check_deps_SetEEFrame
[  0%] Built target _franka_msgs_generate_messages_check_deps_ErrorRecoveryAction
[  0%] Built target actionlib_msgs_generate_messages_py
[  0%] Built target _franka_msgs_generate_messages_check_deps_Errors
[  0%] Built target _franka_msgs_generate_messages_check_deps_FrankaState
[  0%] Built target _franka_msgs_generate_messages_check_deps_ErrorRecoveryActionGoal
[  0%] Built target _franka_msgs_generate_messages_check_deps_ErrorRecoveryGoal
[  0%] Built target _franka_msgs_generate_messages_check_deps_ErrorRecoveryActionFeedback
[  0%] Built target std_msgs_generate_messages_nodejs
[  0%] Built target actionlib_msgs_generate_messages_nodejs
[  0%] Built target _franka_msgs_generate_messages_check_deps_ErrorRecoveryActionResult
[  0%] Built target std_msgs_generate_messages_lisp
[  0%] Built target actionlib_msgs_generate_messages_lisp
[  0%] Built target actionlib_msgs_generate_messages_cpp
[  0%] Built target std_msgs_generate_messages_cpp
[  0%] Built target std_msgs_generate_messages_eus
[  0%] Built target actionlib_msgs_generate_messages_eus
[ 21%] Built target franka_msgs_generate_messages_py
[ 40%] Built target franka_msgs_generate_messages_nodejs
[ 60%] Built target franka_msgs_generate_messages_cpp
[ 79%] Built target franka_msgs_generate_messages_lisp
[100%] Built target franka_msgs_generate_messages_eus
[100%] Built target franka_msgs_generate_messages
