[01m[K/home/anqiu/ros_ws/panda_teleop_ws/src/ros_haptic_teleop/src/teleop.cpp:[m[K In member function ‘[01m[Kvoid teleop::Teleop::update()[m[K’:
[01m[K/home/anqiu/ros_ws/panda_teleop_ws/src/ros_haptic_teleop/src/teleop.cpp:860:39:[m[K [01;31m[Kerror: [m[K‘[01m[Kadditional_force[m[K’ was not declared in this scope
  860 |                         des_F_h(2) += [01;31m[Kadditional_force[m[K;
      |                                       [01;31m[K^~~~~~~~~~~~~~~~[m[K
make[2]: *** [CMakeFiles/ros_haptic_teleop.dir/build.make:76: CMakeFiles/ros_haptic_teleop.dir/src/teleop.cpp.o] Error 1
make[1]: *** [CMakeFiles/Makefile2:424: CMakeFiles/ros_haptic_teleop.dir/all] Error 2
make: *** [Makefile:141: all] Error 2
