Linked: (/home/anqiu/ros_ws/panda_teleop_ws/devel/.private/teleop_msgs/share/common-lisp/ros/teleop_msgs/srv/_package_PathParams.lisp, /home/anqiu/ros_ws/panda_teleop_ws/devel/share/common-lisp/ros/teleop_msgs/srv/_package_PathParams.lisp)
Linked: (/home/anqiu/ros_ws/panda_teleop_ws/devel/.private/teleop_msgs/share/common-lisp/ros/teleop_msgs/srv/_package_InterestPose.lisp, /home/anqiu/ros_ws/panda_teleop_ws/devel/share/common-lisp/ros/teleop_msgs/srv/_package_InterestPose.lisp)
Linked: (/home/anqiu/ros_ws/panda_teleop_ws/devel/.private/teleop_msgs/share/common-lisp/ros/teleop_msgs/srv/_package_SDGains.lisp, /home/anqiu/ros_ws/panda_teleop_ws/devel/share/common-lisp/ros/teleop_msgs/srv/_package_SDGains.lisp)
Linked: (/home/anqiu/ros_ws/panda_teleop_ws/devel/.private/teleop_msgs/share/common-lisp/ros/teleop_msgs/srv/SDGains.lisp, /home/anqiu/ros_ws/panda_teleop_ws/devel/share/common-lisp/ros/teleop_msgs/srv/SDGains.lisp)
Linked: (/home/anqiu/ros_ws/panda_teleop_ws/devel/.private/teleop_msgs/share/common-lisp/ros/teleop_msgs/srv/PathParams.lisp, /home/anqiu/ros_ws/panda_teleop_ws/devel/share/common-lisp/ros/teleop_msgs/srv/PathParams.lisp)
Linked: (/home/anqiu/ros_ws/panda_teleop_ws/devel/.private/teleop_msgs/share/common-lisp/ros/teleop_msgs/srv/teleop_msgs-srv.asd, /home/anqiu/ros_ws/panda_teleop_ws/devel/share/common-lisp/ros/teleop_msgs/srv/teleop_msgs-srv.asd)
Linked: (/home/anqiu/ros_ws/panda_teleop_ws/devel/.private/teleop_msgs/share/common-lisp/ros/teleop_msgs/srv/_package_RGParams.lisp, /home/anqiu/ros_ws/panda_teleop_ws/devel/share/common-lisp/ros/teleop_msgs/srv/_package_RGParams.lisp)
Linked: (/home/anqiu/ros_ws/panda_teleop_ws/devel/.private/teleop_msgs/share/common-lisp/ros/teleop_msgs/srv/RGParams.lisp, /home/anqiu/ros_ws/panda_teleop_ws/devel/share/common-lisp/ros/teleop_msgs/srv/RGParams.lisp)
Linked: (/home/anqiu/ros_ws/panda_teleop_ws/devel/.private/teleop_msgs/share/common-lisp/ros/teleop_msgs/srv/_package_PFParams.lisp, /home/anqiu/ros_ws/panda_teleop_ws/devel/share/common-lisp/ros/teleop_msgs/srv/_package_PFParams.lisp)
Linked: (/home/anqiu/ros_ws/panda_teleop_ws/devel/.private/teleop_msgs/share/common-lisp/ros/teleop_msgs/srv/InterestPose.lisp, /home/anqiu/ros_ws/panda_teleop_ws/devel/share/common-lisp/ros/teleop_msgs/srv/InterestPose.lisp)
Linked: (/home/anqiu/ros_ws/panda_teleop_ws/devel/.private/teleop_msgs/share/common-lisp/ros/teleop_msgs/srv/_package.lisp, /home/anqiu/ros_ws/panda_teleop_ws/devel/share/common-lisp/ros/teleop_msgs/srv/_package.lisp)
Linked: (/home/anqiu/ros_ws/panda_teleop_ws/devel/.private/teleop_msgs/share/common-lisp/ros/teleop_msgs/srv/GTParams.lisp, /home/anqiu/ros_ws/panda_teleop_ws/devel/share/common-lisp/ros/teleop_msgs/srv/GTParams.lisp)
Linked: (/home/anqiu/ros_ws/panda_teleop_ws/devel/.private/teleop_msgs/share/common-lisp/ros/teleop_msgs/srv/_package_GTParams.lisp, /home/anqiu/ros_ws/panda_teleop_ws/devel/share/common-lisp/ros/teleop_msgs/srv/_package_GTParams.lisp)
Linked: (/home/anqiu/ros_ws/panda_teleop_ws/devel/.private/teleop_msgs/share/common-lisp/ros/teleop_msgs/srv/PFParams.lisp, /home/anqiu/ros_ws/panda_teleop_ws/devel/share/common-lisp/ros/teleop_msgs/srv/PFParams.lisp)
Linked: (/home/anqiu/ros_ws/panda_teleop_ws/devel/.private/teleop_msgs/share/gennodejs/ros/teleop_msgs/_index.js, /home/anqiu/ros_ws/panda_teleop_ws/devel/share/gennodejs/ros/teleop_msgs/_index.js)
Linked: (/home/anqiu/ros_ws/panda_teleop_ws/devel/.private/teleop_msgs/share/gennodejs/ros/teleop_msgs/srv/_index.js, /home/anqiu/ros_ws/panda_teleop_ws/devel/share/gennodejs/ros/teleop_msgs/srv/_index.js)
Linked: (/home/anqiu/ros_ws/panda_teleop_ws/devel/.private/teleop_msgs/share/gennodejs/ros/teleop_msgs/srv/GTParams.js, /home/anqiu/ros_ws/panda_teleop_ws/devel/share/gennodejs/ros/teleop_msgs/srv/GTParams.js)
Linked: (/home/anqiu/ros_ws/panda_teleop_ws/devel/.private/teleop_msgs/share/gennodejs/ros/teleop_msgs/srv/PathParams.js, /home/anqiu/ros_ws/panda_teleop_ws/devel/share/gennodejs/ros/teleop_msgs/srv/PathParams.js)
Linked: (/home/anqiu/ros_ws/panda_teleop_ws/devel/.private/teleop_msgs/share/gennodejs/ros/teleop_msgs/srv/SDGains.js, /home/anqiu/ros_ws/panda_teleop_ws/devel/share/gennodejs/ros/teleop_msgs/srv/SDGains.js)
Linked: (/home/anqiu/ros_ws/panda_teleop_ws/devel/.private/teleop_msgs/share/gennodejs/ros/teleop_msgs/srv/RGParams.js, /home/anqiu/ros_ws/panda_teleop_ws/devel/share/gennodejs/ros/teleop_msgs/srv/RGParams.js)
Linked: (/home/anqiu/ros_ws/panda_teleop_ws/devel/.private/teleop_msgs/share/gennodejs/ros/teleop_msgs/srv/PFParams.js, /home/anqiu/ros_ws/panda_teleop_ws/devel/share/gennodejs/ros/teleop_msgs/srv/PFParams.js)
Linked: (/home/anqiu/ros_ws/panda_teleop_ws/devel/.private/teleop_msgs/share/gennodejs/ros/teleop_msgs/srv/InterestPose.js, /home/anqiu/ros_ws/panda_teleop_ws/devel/share/gennodejs/ros/teleop_msgs/srv/InterestPose.js)
Linked: (/home/anqiu/ros_ws/panda_teleop_ws/devel/.private/teleop_msgs/share/roseus/ros/teleop_msgs/manifest.l, /home/anqiu/ros_ws/panda_teleop_ws/devel/share/roseus/ros/teleop_msgs/manifest.l)
Linked: (/home/anqiu/ros_ws/panda_teleop_ws/devel/.private/teleop_msgs/share/roseus/ros/teleop_msgs/srv/PFParams.l, /home/anqiu/ros_ws/panda_teleop_ws/devel/share/roseus/ros/teleop_msgs/srv/PFParams.l)
Linked: (/home/anqiu/ros_ws/panda_teleop_ws/devel/.private/teleop_msgs/share/roseus/ros/teleop_msgs/srv/RGParams.l, /home/anqiu/ros_ws/panda_teleop_ws/devel/share/roseus/ros/teleop_msgs/srv/RGParams.l)
Linked: (/home/anqiu/ros_ws/panda_teleop_ws/devel/.private/teleop_msgs/share/roseus/ros/teleop_msgs/srv/PathParams.l, /home/anqiu/ros_ws/panda_teleop_ws/devel/share/roseus/ros/teleop_msgs/srv/PathParams.l)
Linked: (/home/anqiu/ros_ws/panda_teleop_ws/devel/.private/teleop_msgs/share/roseus/ros/teleop_msgs/srv/GTParams.l, /home/anqiu/ros_ws/panda_teleop_ws/devel/share/roseus/ros/teleop_msgs/srv/GTParams.l)
Linked: (/home/anqiu/ros_ws/panda_teleop_ws/devel/.private/teleop_msgs/share/roseus/ros/teleop_msgs/srv/SDGains.l, /home/anqiu/ros_ws/panda_teleop_ws/devel/share/roseus/ros/teleop_msgs/srv/SDGains.l)
Linked: (/home/anqiu/ros_ws/panda_teleop_ws/devel/.private/teleop_msgs/share/roseus/ros/teleop_msgs/srv/InterestPose.l, /home/anqiu/ros_ws/panda_teleop_ws/devel/share/roseus/ros/teleop_msgs/srv/InterestPose.l)
Linked: (/home/anqiu/ros_ws/panda_teleop_ws/devel/.private/teleop_msgs/share/teleop_msgs/cmake/teleop_msgsConfig.cmake, /home/anqiu/ros_ws/panda_teleop_ws/devel/share/teleop_msgs/cmake/teleop_msgsConfig.cmake)
Linked: (/home/anqiu/ros_ws/panda_teleop_ws/devel/.private/teleop_msgs/share/teleop_msgs/cmake/teleop_msgs-msg-paths.cmake, /home/anqiu/ros_ws/panda_teleop_ws/devel/share/teleop_msgs/cmake/teleop_msgs-msg-paths.cmake)
Linked: (/home/anqiu/ros_ws/panda_teleop_ws/devel/.private/teleop_msgs/share/teleop_msgs/cmake/teleop_msgs-msg-extras.cmake, /home/anqiu/ros_ws/panda_teleop_ws/devel/share/teleop_msgs/cmake/teleop_msgs-msg-extras.cmake)
Linked: (/home/anqiu/ros_ws/panda_teleop_ws/devel/.private/teleop_msgs/share/teleop_msgs/cmake/teleop_msgsConfig-version.cmake, /home/anqiu/ros_ws/panda_teleop_ws/devel/share/teleop_msgs/cmake/teleop_msgsConfig-version.cmake)
Linked: (/home/anqiu/ros_ws/panda_teleop_ws/devel/.private/teleop_msgs/lib/pkgconfig/teleop_msgs.pc, /home/anqiu/ros_ws/panda_teleop_ws/devel/lib/pkgconfig/teleop_msgs.pc)
Linked: (/home/anqiu/ros_ws/panda_teleop_ws/devel/.private/teleop_msgs/lib/python3/dist-packages/teleop_msgs/__init__.py, /home/anqiu/ros_ws/panda_teleop_ws/devel/lib/python3/dist-packages/teleop_msgs/__init__.py)
Linked: (/home/anqiu/ros_ws/panda_teleop_ws/devel/.private/teleop_msgs/lib/python3/dist-packages/teleop_msgs/srv/_PathParams.py, /home/anqiu/ros_ws/panda_teleop_ws/devel/lib/python3/dist-packages/teleop_msgs/srv/_PathParams.py)
Linked: (/home/anqiu/ros_ws/panda_teleop_ws/devel/.private/teleop_msgs/lib/python3/dist-packages/teleop_msgs/srv/_PFParams.py, /home/anqiu/ros_ws/panda_teleop_ws/devel/lib/python3/dist-packages/teleop_msgs/srv/_PFParams.py)
Linked: (/home/anqiu/ros_ws/panda_teleop_ws/devel/.private/teleop_msgs/lib/python3/dist-packages/teleop_msgs/srv/__init__.py, /home/anqiu/ros_ws/panda_teleop_ws/devel/lib/python3/dist-packages/teleop_msgs/srv/__init__.py)
Linked: (/home/anqiu/ros_ws/panda_teleop_ws/devel/.private/teleop_msgs/lib/python3/dist-packages/teleop_msgs/srv/_InterestPose.py, /home/anqiu/ros_ws/panda_teleop_ws/devel/lib/python3/dist-packages/teleop_msgs/srv/_InterestPose.py)
Linked: (/home/anqiu/ros_ws/panda_teleop_ws/devel/.private/teleop_msgs/lib/python3/dist-packages/teleop_msgs/srv/_GTParams.py, /home/anqiu/ros_ws/panda_teleop_ws/devel/lib/python3/dist-packages/teleop_msgs/srv/_GTParams.py)
Linked: (/home/anqiu/ros_ws/panda_teleop_ws/devel/.private/teleop_msgs/lib/python3/dist-packages/teleop_msgs/srv/_RGParams.py, /home/anqiu/ros_ws/panda_teleop_ws/devel/lib/python3/dist-packages/teleop_msgs/srv/_RGParams.py)
Linked: (/home/anqiu/ros_ws/panda_teleop_ws/devel/.private/teleop_msgs/lib/python3/dist-packages/teleop_msgs/srv/_SDGains.py, /home/anqiu/ros_ws/panda_teleop_ws/devel/lib/python3/dist-packages/teleop_msgs/srv/_SDGains.py)
Linked: (/home/anqiu/ros_ws/panda_teleop_ws/devel/.private/teleop_msgs/include/teleop_msgs/RGParams.h, /home/anqiu/ros_ws/panda_teleop_ws/devel/include/teleop_msgs/RGParams.h)
Linked: (/home/anqiu/ros_ws/panda_teleop_ws/devel/.private/teleop_msgs/include/teleop_msgs/PFParams.h, /home/anqiu/ros_ws/panda_teleop_ws/devel/include/teleop_msgs/PFParams.h)
Linked: (/home/anqiu/ros_ws/panda_teleop_ws/devel/.private/teleop_msgs/include/teleop_msgs/SDGains.h, /home/anqiu/ros_ws/panda_teleop_ws/devel/include/teleop_msgs/SDGains.h)
Linked: (/home/anqiu/ros_ws/panda_teleop_ws/devel/.private/teleop_msgs/include/teleop_msgs/PFParamsRequest.h, /home/anqiu/ros_ws/panda_teleop_ws/devel/include/teleop_msgs/PFParamsRequest.h)
Linked: (/home/anqiu/ros_ws/panda_teleop_ws/devel/.private/teleop_msgs/include/teleop_msgs/InterestPoseRequest.h, /home/anqiu/ros_ws/panda_teleop_ws/devel/include/teleop_msgs/InterestPoseRequest.h)
Linked: (/home/anqiu/ros_ws/panda_teleop_ws/devel/.private/teleop_msgs/include/teleop_msgs/PathParamsResponse.h, /home/anqiu/ros_ws/panda_teleop_ws/devel/include/teleop_msgs/PathParamsResponse.h)
Linked: (/home/anqiu/ros_ws/panda_teleop_ws/devel/.private/teleop_msgs/include/teleop_msgs/GTParamsRequest.h, /home/anqiu/ros_ws/panda_teleop_ws/devel/include/teleop_msgs/GTParamsRequest.h)
Linked: (/home/anqiu/ros_ws/panda_teleop_ws/devel/.private/teleop_msgs/include/teleop_msgs/InterestPoseResponse.h, /home/anqiu/ros_ws/panda_teleop_ws/devel/include/teleop_msgs/InterestPoseResponse.h)
Linked: (/home/anqiu/ros_ws/panda_teleop_ws/devel/.private/teleop_msgs/include/teleop_msgs/RGParamsResponse.h, /home/anqiu/ros_ws/panda_teleop_ws/devel/include/teleop_msgs/RGParamsResponse.h)
Linked: (/home/anqiu/ros_ws/panda_teleop_ws/devel/.private/teleop_msgs/include/teleop_msgs/RGParamsRequest.h, /home/anqiu/ros_ws/panda_teleop_ws/devel/include/teleop_msgs/RGParamsRequest.h)
Linked: (/home/anqiu/ros_ws/panda_teleop_ws/devel/.private/teleop_msgs/include/teleop_msgs/SDGainsRequest.h, /home/anqiu/ros_ws/panda_teleop_ws/devel/include/teleop_msgs/SDGainsRequest.h)
Linked: (/home/anqiu/ros_ws/panda_teleop_ws/devel/.private/teleop_msgs/include/teleop_msgs/PathParamsRequest.h, /home/anqiu/ros_ws/panda_teleop_ws/devel/include/teleop_msgs/PathParamsRequest.h)
Linked: (/home/anqiu/ros_ws/panda_teleop_ws/devel/.private/teleop_msgs/include/teleop_msgs/PFParamsResponse.h, /home/anqiu/ros_ws/panda_teleop_ws/devel/include/teleop_msgs/PFParamsResponse.h)
Linked: (/home/anqiu/ros_ws/panda_teleop_ws/devel/.private/teleop_msgs/include/teleop_msgs/PathParams.h, /home/anqiu/ros_ws/panda_teleop_ws/devel/include/teleop_msgs/PathParams.h)
Linked: (/home/anqiu/ros_ws/panda_teleop_ws/devel/.private/teleop_msgs/include/teleop_msgs/InterestPose.h, /home/anqiu/ros_ws/panda_teleop_ws/devel/include/teleop_msgs/InterestPose.h)
Linked: (/home/anqiu/ros_ws/panda_teleop_ws/devel/.private/teleop_msgs/include/teleop_msgs/GTParams.h, /home/anqiu/ros_ws/panda_teleop_ws/devel/include/teleop_msgs/GTParams.h)
Linked: (/home/anqiu/ros_ws/panda_teleop_ws/devel/.private/teleop_msgs/include/teleop_msgs/SDGainsResponse.h, /home/anqiu/ros_ws/panda_teleop_ws/devel/include/teleop_msgs/SDGainsResponse.h)
Linked: (/home/anqiu/ros_ws/panda_teleop_ws/devel/.private/teleop_msgs/include/teleop_msgs/GTParamsResponse.h, /home/anqiu/ros_ws/panda_teleop_ws/devel/include/teleop_msgs/GTParamsResponse.h)
