[01m[K/home/anqiu/ros_ws/panda_teleop_ws/src/ros_haptic_teleop/src/teleop.cpp:[m[K In member function ‘[01m[Kvoid teleop::Teleop::DMPsYTrackCallback(const ConstPtr&)[m[K’:
[01m[K/home/anqiu/ros_ws/panda_teleop_ws/src/ros_haptic_teleop/src/teleop.cpp:730:76:[m[K [01;31m[Kerror: [m[Kno match for ‘[01m[Koperator-[m[K’ (operand types are ‘[01m[KEigen::Matrix<double, 3, 1>[m[K’ and ‘[01m[Kgeometry_msgs::Point_<std::allocator<void> >::_z_type[m[K’ {aka ‘[01m[Kdouble[m[K’})
  730 |             Eigen::Vector3d relative_dmp_translation = [32m[KX_dmp.translation()[m[K [01;31m[K-[m[K [34m[K(initial_y_track_pose.pose.position.x,[m[K
      |                                                        [32m[K~~~~~~~~~~~~~~~~~~~[m[K [01;31m[K^[m[K [34m[K~~~~~~~~~~~~~~~~~~~~~~~~~~~~~~~~~~~~~~[m[K
      |                                                                         [32m[K|[m[K
      |                                                                         [32m[KEigen::Matrix<double, 3, 1>[m[K
  731 | [34m[K                                                                   initial_y_track_pose.pose.position.y,[m[K
      |                                                                    [34m[K~~~~~~~~~~~~~~~~~~~~~~~~~~~~~~~~~~~~~[m[K
      |                                                                                                        [34m[K|[m[K
      |                                                                                                        [34m[Kgeometry_msgs::Point_<std::allocator<void> >::_z_type {aka double}[m[K
  732 | [34m[K                                                                   initial_y_track_pose.pose.position.z)[m[K;
      |                                                                    [34m[K~~~~~~~~~~~~~~~~~~~~~~~~~~~~~~~~~~~~~[m[K
In file included from [01m[K/usr/include/eigen3/Eigen/src/Core/MatrixBase.h:125[m[K,
                 from [01m[K/usr/include/eigen3/Eigen/Core:436[m[K,
                 from [01m[K/opt/ros/noetic/include/pinocchio/utils/cast.hpp:8[m[K,
                 from [01m[K/opt/ros/noetic/include/pinocchio/fwd.hpp:23[m[K,
                 from [01m[K/home/anqiu/ros_ws/panda_teleop_ws/src/ros_haptic_teleop/include/teleop/teleop.h:4[m[K,
                 from [01m[K/home/anqiu/ros_ws/panda_teleop_ws/src/ros_haptic_teleop/src/teleop.cpp:1[m[K:
[01m[K/usr/include/eigen3/Eigen/src/plugins/CommonCwiseUnaryOps.h:45:1:[m[K [01;36m[Knote: [m[Kcandidate: ‘[01m[Kconst NegativeReturnType Eigen::MatrixBase<Derived>::operator-() const [with Derived = Eigen::Matrix<double, 3, 1>; Eigen::MatrixBase<Derived>::NegativeReturnType = Eigen::CwiseUnaryOp<Eigen::internal::scalar_opposite_op<double>, const Eigen::Matrix<double, 3, 1> >; typename Eigen::internal::traits<T>::Scalar = double][m[K’
   45 | [01;36m[Koperator[m[K-() const { return NegativeReturnType(derived()); }
      | [01;36m[K^~~~~~~~[m[K
[01m[K/usr/include/eigen3/Eigen/src/plugins/CommonCwiseUnaryOps.h:45:1:[m[K [01;36m[Knote: [m[K  candidate expects 0 arguments, 1 provided
In file included from [01m[K/usr/include/eigen3/Eigen/Core:88[m[K,
                 from [01m[K/opt/ros/noetic/include/pinocchio/utils/cast.hpp:8[m[K,
                 from [01m[K/opt/ros/noetic/include/pinocchio/fwd.hpp:23[m[K,
                 from [01m[K/home/anqiu/ros_ws/panda_teleop_ws/src/ros_haptic_teleop/include/teleop/teleop.h:4[m[K,
                 from [01m[K/home/anqiu/ros_ws/panda_teleop_ws/src/ros_haptic_teleop/src/teleop.cpp:1[m[K:
[01m[K/usr/include/eigen3/Eigen/src/plugins/CommonCwiseBinaryOps.h:19:1:[m[K [01;36m[Knote: [m[Kcandidate: ‘[01m[Ktemplate<class OtherDerived> const Eigen::CwiseBinaryOp<Eigen::internal::scalar_difference_op<typename Eigen::internal::traits<T>::Scalar, typename Eigen::internal::traits<OtherDerived>::Scalar>, const Derived, const OtherDerived> Eigen::MatrixBase<Derived>::operator-(const Eigen::MatrixBase<OtherDerived>&) const [with OtherDerived = OtherDerived; Derived = Eigen::Matrix<double, 3, 1>][m[K’
   19 | [01;36m[KEIGEN_MAKE_CWISE_BINARY_OP[m[K(operator-,difference)
      | [01;36m[K^~~~~~~~~~~~~~~~~~~~~~~~~~[m[K
[01m[K/usr/include/eigen3/Eigen/src/plugins/CommonCwiseBinaryOps.h:19:1:[m[K [01;36m[Knote: [m[K  template argument deduction/substitution failed:
[01m[K/home/anqiu/ros_ws/panda_teleop_ws/src/ros_haptic_teleop/src/teleop.cpp:732:104:[m[K [01;36m[Knote: [m[K  mismatched types ‘[01m[Kconst Eigen::MatrixBase<Derived>[m[K’ and ‘[01m[Kgeometry_msgs::Point_<std::allocator<void> >::_z_type[m[K’ {aka ‘[01m[Kdouble[m[K’}
  732 |                                                                    initial_y_track_pose.pose.position.z[01;36m[K)[m[K;
      |                                                                                                        [01;36m[K^[m[K
[01m[K/home/anqiu/ros_ws/panda_teleop_ws/src/ros_haptic_teleop/src/teleop.cpp:734:116:[m[K [01;31m[Kerror: [m[K‘[01m[Kgeometry_msgs::PoseStamped[m[K’ {aka ‘[01m[Kstruct geometry_msgs::PoseStamped_<std::allocator<void> >[m[K’} has no member named ‘[01m[Krotation[m[K’
  734 |             Eigen::AngleAxisd X_dmp_rotation_relative = Eigen::AngleAxisd(X_dmp.rotation() * (initial_y_track_pose.[01;31m[Krotation[m[K()).transpose());
      |                                                                                                                    [01;31m[K^~~~~~~~[m[K
[01m[K/home/anqiu/ros_ws/panda_teleop_ws/src/ros_haptic_teleop/src/teleop.cpp:736:176:[m[K [01;31m[Kerror: [m[K‘[01m[Kgeometry_msgs::PoseStamped[m[K’ {aka ‘[01m[Kstruct geometry_msgs::PoseStamped_<std::allocator<void> >[m[K’} has no member named ‘[01m[Krotation[m[K’
  736 |             scale_X_dmp.rotation() = haptic_to_robot_rotation * scale_X_dmp_rotation_relative.toRotationMatrix() * haptic_to_robot_rotation.transpose() * initial_y_track_pose.[01;31m[Krotation[m[K();
      |                                                                                                                                                                                [01;31m[K^~~~~~~~[m[K
make[2]: *** [CMakeFiles/ros_haptic_teleop.dir/build.make:76: CMakeFiles/ros_haptic_teleop.dir/src/teleop.cpp.o] Error 1
make[1]: *** [CMakeFiles/Makefile2:424: CMakeFiles/ros_haptic_teleop.dir/all] Error 2
make: *** [Makefile:141: all] Error 2
