%YAML 1.1
%TAG !u! tag:unity3d.com,2011:
--- !u!78 &1
TagManager:
  serializedVersion: 2
  tags:
  - Light
  - Wall
  - HeadPlayer
  - AgentModels
  - VirtualHumanActive
  - GameManager
  - SelectionControl
  - Stage
  - Pillar
  - Robot
  - Sensor
  - Sensors
  - VirtualRobotActive
  - 3DObjects
  - AnimControl
  layers:
  - Default
  - TransparentFX
  - Ignore Raycast
  - 
  - Water
  - UI
  - 
  - 
  - 
  - 
  - 
  - 
  - 
  - 
  - 
  - 
  - 
  - 
  - 
  - 
  - 
  - 
  - 
  - 
  - 
  - 
  - 
  - 
  - 
  - 
  - 
  - 
  m_SortingLayers:
  - name: Default
    uniqueID: 0
    locked: 0
