"Fichier","Start Frame","End Frame"
"m_idle_angry_01",0,850
"m_idle_angry_02",851,1356
"m_idle_breathe_01",1357,1439
"m_idle_breathe_02",1440,1740
"m_idle_breathe_03",1741,2242
"m_idle_cough_01",2243,2353
"m_idle_cough_02",2354,2519
"m_idle_drunk_01",2520,3829
"m_idle_drunk_02",3830,5263
"m_idle_dust_01",5264,5429
"m_idle_dust_02",5430,5595
"m_idle_look_around_01",5596,5761
"m_idle_look_around_02",5762,5897
"m_idle_look_around_03",5898,6254
"m_idle_nervous_01",6255,7182
"m_idle_nervous_02",7183,8715
"m_idle_nervous_03",8716,9144
"m_idle_neutral_01",9145,9495
"m_idle_neutral_02",9496,9961
"m_idle_neutral_03",9962,10962
"m_idle_neutral_04",10963,12227
"m_idle_neutral_05",12228,13264
"m_idle_neutral_06",13265,14232
"m_idle_neutral_07",14233,15143
"m_idle_neutral_08",15144,16680
"m_idle_neutral_09",16681,17331
"m_idle_roll_head_01",17332,17562
"m_idle_scratch_head_01",17563,17712
"m_idle_scratch_head_02",17713,17842
"m_idle_shake_arms_01",17843,17963
"m_idle_shake_leg_01",17964,18098
"m_idle_stretch_arms_01",18099,18298
"m_idle_touch_face_01",18299,18478
"m_idle_touch_face_02",18479,18768
"m_idle_touch_hair_01",18769,18919
"m_idle_waiting_01",18920,20330
"m_idle_waiting_02",20331,21355
"m_idle_yawn_01",21356,21633
