tests: update

9 jobs for feature-a/3654-germlines-tests-algo in 3 minutes and 19 seconds (queued for 1 second)
latest
Status Job ID Name Coverage
  Test Tools
passed #224011
test_tools

00:00:06

 
  Test Unit
failed #224012
test_algo_unit

00:03:12

 
  Test Functional
skipped #224013
test_algo_should
 
  Test Shouldvdj
skipped #224014
test_algo_shouldvdj
 
  Coverage
skipped #224015
algo_coverage
 
  Prepare Release
skipped #224016
allowed to fail manual
prepare_release
 
  Valgrind Unit
skipped #224017
valgrind
algo_valgrind_unit
 
  Valgrind Functional
skipped #224018
valgrind allowed to fail manual
algo_valgrind_functional
 
  Multiple Tests
skipped #224019
several-compilers allowed to fail manual
test_various_compilers_manual
 
Name Stage Failure
failed
test_algo_unit Test Unit
make[2]: *** [test] Aborted
make[2]: Leaving directory '/home/gitlab-runner/builds/b8d876c1/0/vidjil/vidjil/algo/tests'
Makefile:174: recipe for target 'unit' failed
make[1]: *** [unit] Error 2
make[1]: Leaving directory '/home/gitlab-runner/builds/b8d876c1/0/vidjil/vidjil/algo'
Makefile:209: recipe for target 'unit_coverage' failed
make: *** [unit_coverage] Error 2
make: Leaving directory '/home/gitlab-runner/builds/b8d876c1/0/vidjil/vidjil/algo'
ERROR: Job failed: exit status 1