vidjil-h-examples.should-get: TRGJ1*01 is now identical to TRGJ1*02

10 jobs from feature-ag/3133-downstream-length in 22 minutes and 34 seconds (queued for 1 second)
latest
Status Job ID Name Coverage
  Test Tools
passed #143143
test_tools

00:00:03

 
  Test Unit
passed #143144
test_algo_unit

00:03:10

 
  Test Germlines
passed #143145
test_germlines

00:07:03

 
  Test Functional
failed #143146
test_algo_should

00:12:16

 
  Test Shouldvdj
skipped #143147
test_algo_shouldvdj
 
  Coverage
skipped #143148
algo_coverage
 
  Prepare Release
skipped #143149
allowed to fail manual
prepare_release
 
  Valgrind Unit
skipped #143150
valgrind
algo_valgrind_unit
 
  Valgrind Functional
skipped #143151
valgrind allowed to fail manual
algo_valgrind_functional
 
  Multiple Tests
skipped #143152
several-compilers allowed to fail manual
test_various_compilers_manual
 
Name Stage Failure
failed
test_algo_should Test Functional There is an unknown failure, please try again
make[2]: *** [should] Error 1
make[2]: Leaving directory '/home/gitlab-runner/builds/b8d876c1/0/vidjil/vidjil/algo/tests'
Makefile:184: recipe for target 'should' failed
make[1]: *** [should] Error 2
make[1]: Leaving directory '/home/gitlab-runner/builds/b8d876c1/0/vidjil/vidjil/algo'
Makefile:212: recipe for target 'should_coverage' failed
make: *** [should_coverage] Error 2
make: Leaving directory '/home/gitlab-runner/builds/b8d876c1/0/vidjil/vidjil/algo'
ERROR: Job failed: exit status 1