vidjil.cpp, PAD_HELP, message of --all

9 jobs from feature-a/3295-option-names in 14 minutes and 45 seconds (queued for 2 seconds)
Status Job ID Name Coverage
  Test Tools
passed #141939
test_tools

00:00:05

 
  Test Unit
passed #141940
test_algo_unit

00:03:29

 
  Test Functional
failed #141941
test_algo_should

00:11:11

 
  Test Shouldvdj
skipped #141942
test_algo_shouldvdj
 
  Coverage
skipped #141943
algo_coverage
 
  Prepare Release
skipped #141944
allowed to fail manual
prepare_release
 
  Valgrind Unit
skipped #141945
valgrind
algo_valgrind_unit
 
  Valgrind Functional
skipped #141946
valgrind allowed to fail manual
algo_valgrind_functional
 
  Multiple Tests
skipped #141947
several-compilers allowed to fail manual
test_various_compilers_manual
 
Name Stage Failure
failed
test_algo_should Test Functional There is an unknown failure, please try again
make[2]: *** [should] Error 1
make[2]: Leaving directory '/home/gitlab-runner/builds/b8d876c1/0/vidjil/vidjil/algo/tests'
Makefile:184: recipe for target 'should' failed
make[1]: *** [should] Error 2
make[1]: Leaving directory '/home/gitlab-runner/builds/b8d876c1/0/vidjil/vidjil/algo'
Makefile:212: recipe for target 'should_coverage' failed
make: *** [should_coverage] Error 2
make: Leaving directory '/home/gitlab-runner/builds/b8d876c1/0/vidjil/vidjil/algo'
ERROR: Job failed: exit status 1