doc/user.md: bikeshed doc

Status Job ID Name Coverage
  Test Tools
passed #518224
test_tools

00:00:08

 
  Test Quality
passed #518225
web
code_quality

00:00:10

 
  Test Unit
passed #518226
web
test_browser_unit

00:00:19

 
  Deploy Review
passed #518227
web
deploy_review

00:00:06

manual #518228
web allowed to fail manual
stop_deploy_review
 
  Test Functional
failed #518333
web
chrome-browser-functional

00:02:49

failed #518286
web
ff32-browser-functional

00:02:26

failed #518321
web
ff45-browser-functional

00:03:20

failed #518294
legacy
old-chrome-browser-functional

00:04:19

failed #518231
web
chrome-browser-functional

00:04:22

failed #518295
web
chrome-browser-functional

00:02:41

failed #518229
web
ff32-browser-functional

00:02:23

failed #518269
web
ff32-browser-functional

00:02:18

failed #518271
web
ff45-browser-functional

00:03:19

failed #518230
web
ff45-browser-functional

00:02:47

failed #518232
legacy
old-chrome-browser-functional

00:02:27

failed #518273
legacy
old-chrome-browser-functional

00:02:50

 
  Test Functional External
skipped #518235
web
chrome-browser-functional-external
skipped #518233
web
ff32-browser-functional-external
skipped #518234
web
ff45-browser-functional-external
skipped #518236
legacy
old-chrome-browser-functional-external-chrome
 
  Tgz Release
skipped #518237
doc
build_doc
 
  Deploy Prod
skipped #518238
allowed to fail manual
deploy_doc
 
Name Stage Failure
failed
chrome-browser-functional Test Functional

Makefile:11: recipe for target 'functional' failed
make: *** [functional] Error 1
make: Leaving directory '/home/gitlab-runner/builds/ziJxcFPn/0/vidjil/vidjil/browser/test'
Uploading artifacts...
Runtime platform arch=amd64 os=linux pid=12292 revision=58272c27 version=12.7.0
browser/test/test/TEST-*.xml: found 11 matching files

Uploading artifacts to coordinator... ok
id=518333 responseStatus=201 Created token=epN1PrGJ
ERROR: Job failed: exit status 1
failed
ff45-browser-functional Test Functional

Makefile:11: recipe for target 'functional' failed
make: *** [functional] Error 1
make: Leaving directory '/home/gitlab-runner/builds/9103f1f5/0/vidjil/vidjil/browser/test'
Uploading artifacts...
Runtime platform arch=amd64 os=linux pid=28785 revision=58272c27 version=12.7.0
browser/test/test/TEST-*.xml: found 11 matching files

Uploading artifacts to coordinator... ok
id=518321 responseStatus=201 Created token=jzWwmtiR
ERROR: Job failed: exit status 1
failed
ff32-browser-functional Test Functional

Makefile:11: recipe for target 'functional' failed
make: *** [functional] Error 1
make: Leaving directory '/home/gitlab-runner/builds/b8d876c1/0/vidjil/vidjil/browser/test'
Uploading artifacts...
Runtime platform arch=386 os=linux pid=19591 revision=58272c27 version=12.7.0
browser/test/test/TEST-*.xml: found 11 matching files

Uploading artifacts to coordinator... ok
id=518286 responseStatus=201 Created token=sRFLJyPt
ERROR: Job failed: exit status 1
failed
old-chrome-browser-functional Test Functional

Makefile:11: recipe for target 'functional' failed
make: *** [functional] Error 1
make: Leaving directory '/home/gitlab-runner/builds/U7Q_BXuw/0/vidjil/vidjil/browser/test'
Uploading artifacts...
Runtime platform arch=amd64 os=linux pid=30170 revision=4745a6f3 version=11.8.0
browser/test/test/TEST-*.xml: found 11 matching files

Uploading artifacts to coordinator... ok
id=518294 responseStatus=201 Created token=czLkMyCm
ERROR: Job failed: exit status 1