model.js & clone.js; minor housekeeping of function createCloneFromdistribConcat

Link to #4020
22 jobs for feature-c/4020_minor_fix_distribution in 10 minutes and 55 seconds (queued for 1 minute and 46 seconds)
latest
Status Job ID Name Coverage
  Test Tools
passed #472405
test_tools

00:00:07

 
  Test Quality
passed #472406
web
code_quality

00:00:10

 
  Test Unit
passed #472407
web
test_browser_unit

00:00:30

 
  Deploy Review
passed #472408
web
deploy_review

00:00:16

manual #472409
web allowed to fail manual
stop_deploy_review
 
  Test Functional
failed #472432
web
chrome-browser-functional

00:02:15

failed #472429
web
ff32-browser-functional

00:02:06

failed #473641
web
ff45-browser-functional

00:03:25

failed #472444
legacy
old-chrome-browser-functional

00:03:35

failed #472425
web
chrome-browser-functional

00:02:15

failed #472412
web
chrome-browser-functional

00:02:36

failed #472410
web
ff32-browser-functional

00:02:00

failed #472424
web
ff32-browser-functional

00:02:04

failed #472442
web
ff45-browser-functional

00:03:14

failed #472411
web
ff45-browser-functional

00:02:59

failed #472426
web
ff45-browser-functional

00:03:19

failed #472413
legacy
old-chrome-browser-functional

00:02:06

failed #472428
legacy
old-chrome-browser-functional

00:03:30

 
  Test Functional External
skipped #472416
web
chrome-browser-functional-external
skipped #472414
web
ff32-browser-functional-external
skipped #472415
web
ff45-browser-functional-external
skipped #472417
legacy
old-chrome-browser-functional-external-chrome
 
Name Stage Failure
failed
ff45-browser-functional Test Functional
=== functional/test_segmenter_page_errors.rb : ok 

Makefile:11: recipe for target 'functional' failed
make: *** [functional] Error 1
make: Leaving directory '/home/gitlab-runner/builds/9103f1f5/0/vidjil/vidjil/browser/test'
Uploading artifacts...
browser/test/test/TEST-*.xml: found 10 matching files
Uploading artifacts to coordinator... ok
id=473641 responseStatus=201 Created token=MnDRRpsL
ERROR: Job failed: exit status 1
failed
old-chrome-browser-functional Test Functional

Makefile:11: recipe for target 'functional' failed
make: *** [functional] Error 1
make: Leaving directory '/home/gitlab-runner/builds/U7Q_BXuw/0/vidjil/vidjil/browser/test'
Uploading artifacts...
Runtime platform arch=amd64 os=linux pid=31322 revision=4745a6f3 version=11.8.0
browser/test/test/TEST-*.xml: found 10 matching files

Uploading artifacts to coordinator... ok
id=472444 responseStatus=201 Created token=ErhoWHwx
ERROR: Job failed: exit status 1
failed
chrome-browser-functional Test Functional

Makefile:11: recipe for target 'functional' failed
make: *** [functional] Error 1
make: Leaving directory '/home/gitlab-runner/builds/qDWi9stG/0/vidjil/vidjil/browser/test'
Uploading artifacts...
Runtime platform arch=amd64 os=linux pid=21799 revision=692ae235 version=11.9.0
browser/test/test/TEST-*.xml: found 10 matching files

Uploading artifacts to coordinator... ok
id=472432 responseStatus=201 Created token=aPKs3jym
ERROR: Job failed: exit status 1
failed
ff32-browser-functional Test Functional
=== functional/test_segmenter_page_errors.rb : ok 

Makefile:11: recipe for target 'functional' failed
make: *** [functional] Error 1
make: Leaving directory '/home/gitlab-runner/builds/b8d876c1/0/vidjil/vidjil/browser/test'
Uploading artifacts...
browser/test/test/TEST-*.xml: found 10 matching files
Uploading artifacts to coordinator... ok
id=472429 responseStatus=201 Created token=QTpDZTxB
ERROR: Job failed: exit status 1