test_clones.rb; minor fix

Link to #4018
Status Job ID Name Coverage
  Test Tools
passed #470784
test_tools

00:00:07

 
  Test Quality
passed #470785
web
code_quality

00:00:12

 
  Test Unit
passed #470786
web
test_browser_unit

00:00:31

 
  Deploy Review
passed #470787
web
deploy_review

00:00:15

manual #470788
web allowed to fail manual
stop_deploy_review
 
  Test Functional
failed #470856
web
chrome-browser-functional

00:02:20

failed #470855
web
ff32-browser-functional

00:02:09

failed #470858
web
ff45-browser-functional

00:03:20

failed #470859
legacy
old-chrome-browser-functional

00:02:51

failed #470847
web
chrome-browser-functional

00:02:19

failed #470791
web
chrome-browser-functional

00:02:20

failed #470789
web
ff32-browser-functional

00:02:10

failed #470846
web
ff32-browser-functional

00:02:05

failed #470790
web
ff45-browser-functional

00:03:18

failed #470848
web
ff45-browser-functional

00:03:15

failed #470857
legacy
old-chrome-browser-functional

00:02:34

failed #470792
legacy
old-chrome-browser-functional

00:05:14

 
  Test Functional External
skipped #470795
web
chrome-browser-functional-external
skipped #470793
web
ff32-browser-functional-external
skipped #470794
web
ff45-browser-functional-external
skipped #470796
legacy
old-chrome-browser-functional-external-chrome
 
Name Stage Failure
failed
old-chrome-browser-functional Test Functional

Makefile:11: recipe for target 'functional' failed
make: *** [functional] Error 1
make: Leaving directory '/home/gitlab-runner/builds/U7Q_BXuw/0/vidjil/vidjil/browser/test'
Uploading artifacts...
Runtime platform arch=amd64 os=linux pid=15721 revision=4745a6f3 version=11.8.0
browser/test/test/TEST-*.xml: found 10 matching files

Uploading artifacts to coordinator... ok
id=470859 responseStatus=201 Created token=pd9x3jtT
ERROR: Job failed: exit status 1
failed
ff45-browser-functional Test Functional
=== functional/test_segmenter_page_errors.rb : ok 

Makefile:11: recipe for target 'functional' failed
make: *** [functional] Error 1
make: Leaving directory '/home/gitlab-runner/builds/9103f1f5/0/vidjil/vidjil/browser/test'
Uploading artifacts...
browser/test/test/TEST-*.xml: found 10 matching files
Uploading artifacts to coordinator... ok
id=470858 responseStatus=201 Created token=2xobGChi
ERROR: Job failed: exit status 1
failed
chrome-browser-functional Test Functional

Makefile:11: recipe for target 'functional' failed
make: *** [functional] Error 1
make: Leaving directory '/home/gitlab-runner/builds/qDWi9stG/0/vidjil/vidjil/browser/test'
Uploading artifacts...
Runtime platform arch=amd64 os=linux pid=25915 revision=692ae235 version=11.9.0
browser/test/test/TEST-*.xml: found 10 matching files

Uploading artifacts to coordinator... ok
id=470856 responseStatus=201 Created token=gToGUj1b
ERROR: Job failed: exit status 1
failed
ff32-browser-functional Test Functional
=== functional/test_segmenter_page_errors.rb : ok 

Makefile:11: recipe for target 'functional' failed
make: *** [functional] Error 1
make: Leaving directory '/home/gitlab-runner/builds/b8d876c1/0/vidjil/vidjil/browser/test'
Uploading artifacts...
browser/test/test/TEST-*.xml: found 10 matching files
Uploading artifacts to coordinator... ok
id=470855 responseStatus=201 Created token=1u_aE3UW
ERROR: Job failed: exit status 1