tests: make fail some tests to test gitlab

21 jobs for feature-c/junit-test in 4 minutes and 30 seconds (queued for 3 seconds)
latest
Status Job ID Name Coverage
  Test Tools
passed #465466
test_tools

00:00:07

 
  Test Quality
passed #465467
web
code_quality

00:00:09

 
  Test Unit
passed #465468
web
test_browser_unit

00:00:09

 
  Deploy Review
passed #465469
web
deploy_review

00:00:06

manual #465470
web allowed to fail manual
stop_deploy_review
 
  Test Functional
failed #465483
web
chrome-browser-functional

00:02:04

failed #465484
web
ff32-browser-functional

00:02:02

failed #465485
web
ff45-browser-functional

00:03:06

failed #465486
legacy
old-chrome-browser-functional

00:02:14

failed #465481
web
chrome-browser-functional

00:02:10

failed #465473
web
chrome-browser-functional

00:02:09

failed #465471
web
ff32-browser-functional

00:02:34

failed #465479
web
ff32-browser-functional

00:02:25

failed #465472
web
ff45-browser-functional

00:03:04

failed #465480
web
ff45-browser-functional

00:03:07

failed #465474
legacy
old-chrome-browser-functional

00:04:58

failed #465482
legacy
old-chrome-browser-functional

00:03:27

 
  Test Functional External
skipped #465477
web
chrome-browser-functional-external
skipped #465475
web
ff32-browser-functional-external
skipped #465476
web
ff45-browser-functional-external
skipped #465478
legacy
old-chrome-browser-functional-external-chrome
 
Name Stage Failure
failed
ff45-browser-functional Test Functional
=== functional/test_segmenter_page_errors.rb : ok 

Makefile:11: recipe for target 'functional' failed
make: *** [functional] Error 1
make: Leaving directory '/home/gitlab-runner/builds/9103f1f5/0/vidjil/vidjil/browser/test'
Uploading artifacts...
browser/test/test/TEST-*.xml: found 10 matching files
Uploading artifacts to coordinator... ok
id=465485 responseStatus=201 Created token=y_ueX2y_
ERROR: Job failed: exit status 1
failed
old-chrome-browser-functional Test Functional

Makefile:11: recipe for target 'functional' failed
make: *** [functional] Error 1
make: Leaving directory '/home/gitlab-runner/builds/U7Q_BXuw/0/vidjil/vidjil/browser/test'
Uploading artifacts...
Runtime platform arch=amd64 os=linux pid=17749 revision=4745a6f3 version=11.8.0
browser/test/test/TEST-*.xml: found 10 matching files

Uploading artifacts to coordinator... ok
id=465486 responseStatus=201 Created token=cSsmLz1y
ERROR: Job failed: exit status 1
failed
chrome-browser-functional Test Functional

Makefile:11: recipe for target 'functional' failed
make: *** [functional] Error 1
make: Leaving directory '/home/gitlab-runner/builds/qDWi9stG/0/vidjil/vidjil/browser/test'
Uploading artifacts...
Runtime platform arch=amd64 os=linux pid=29347 revision=692ae235 version=11.9.0
browser/test/test/TEST-*.xml: found 10 matching files

Uploading artifacts to coordinator... ok
id=465483 responseStatus=201 Created token=1Prp-6CF
ERROR: Job failed: exit status 1
failed
ff32-browser-functional Test Functional
=== functional/test_segmenter_page_errors.rb : ok 

Makefile:11: recipe for target 'functional' failed
make: *** [functional] Error 1
make: Leaving directory '/home/gitlab-runner/builds/b8d876c1/0/vidjil/vidjil/browser/test'
Uploading artifacts...
browser/test/test/TEST-*.xml: found 10 matching files
Uploading artifacts to coordinator... ok
id=465484 responseStatus=201 Created token=gxksbVVW
ERROR: Job failed: exit status 1