germline/homo-sapiens.g: update ref

See #3362
10 jobs for feature-ag/new-germlines in 21 minutes and 14 seconds (queued for 1 second)
Status Job ID Name Coverage
  Test Tools
passed #135207
test_tools

00:00:03

 
  Test Unit
passed #135208
test_algo_unit

00:02:55

passed #135209
test_tools_unit

00:00:03

 
  Test Germlines
passed #135210
test_germlines

00:07:10

 
  Test Functional
failed #135211
test_algo_should

00:11:00

 
  Test Shouldvdj
skipped #135212
test_algo_shouldvdj
 
  Coverage
skipped #135213
algo_coverage
 
  Prepare Release
skipped #135214
allowed to fail manual
prepare_release
 
  Valgrind Unit
skipped #135215
valgrind
algo_valgrind_unit
 
  Valgrind Functional
skipped #135216
valgrind allowed to fail manual
algo_valgrind_functional
 
Name Stage Failure
failed
test_algo_should Test Functional There is an unknown failure, please try again
make[2]: *** [should] Error 1
make[2]: Leaving directory '/home/gitlab-runner/builds/fcaaa996/0/vidjil/vidjil/algo/tests'
Makefile:184: recipe for target 'should' failed
make[1]: *** [should] Error 2
make[1]: Leaving directory '/home/gitlab-runner/builds/fcaaa996/0/vidjil/vidjil/algo'
Makefile:212: recipe for target 'should_coverage' failed
make: *** [should_coverage] Error 2
make: Leaving directory '/home/gitlab-runner/builds/fcaaa996/0/vidjil/vidjil/algo'
ERROR: Job failed: exit status 1