js/com.js: update team

5 jobs for feature-c/1847 in 2 minutes and 12 seconds (queued for 3 seconds)
Name Stage Failure
failed
test_browser-functional Test Functional There is an unknown failure, please try again
3 runs, 10 assertions, 0 failures, 0 errors, 0 skips

generating ci files
make[2]: *** [functional] Error 1
make[2]: Leaving directory `/home/gitlab_ci_multi_runner/builds/66984086/0/vidjil/vidjil/browser/test'
make[1]: *** [headless] Error 2
make[1]: Leaving directory `/home/gitlab_ci_multi_runner/builds/66984086/0/vidjil/vidjil/browser/test'
make: *** [headless_browser] Error 2
ERROR: Build failed: exit status 1