index.html, js.clone.js: clonotype

see vdj#1223
20 jobs for feature-cdoc/clonotypes in 15 seconds (queued for 4 seconds)
latest
Status Job ID Name Coverage
  Test Tools
failed #1116961
test_tools

00:00:08

 
  Test Quality
failed #1116962
allowed to fail
code_quality

00:00:06

skipped #1116963
web
code_quality_custom
 
  Test Unit
skipped #1116964
web
test_browser_unit
 
  Deploy Review
skipped #1116965
web
deploy_review
skipped #1116966
web allowed to fail manual
stop_deploy_review
 
  Test Functional
skipped #1116969
web
chrome-browser-functional
skipped #1116967
web
ff32-browser-functional
skipped #1116968
web
ff45-browser-functional
skipped #1116970
legacy
old-chrome-browser-functional
 
  Test Tutorial
skipped #1116973
web-pandoc
chrome-browser-tutorial
skipped #1116971
web-pandoc
ff32-browser-tutorial
skipped #1116972
web-pandoc
ff45-browser-tutorial
skipped #1116974
legacy
old-chrome-browser-tutorial
 
  Test Functional External
skipped #1116977
web
chrome-browser-functional-external
skipped #1116975
web
ff32-browser-functional-external
skipped #1116976
web
ff45-browser-functional-external
skipped #1116978
legacy
old-chrome-browser-functional-external-chrome
 
  Tgz Release
skipped #1116979
cidocker allowed to fail
build_doc
 
  Deploy Prod
skipped #1116980
allowed to fail manual
deploy_doc
 
Name Stage Failure
failed
code_quality Test Quality
make[1]: *** [LIL-L4.fastq.gz] Error 4
make[1]: Leaving directory '/home/gitlab-runner/builds/b8d876c1/0/vidjil/vidjil/demo'
Makefile:66: recipe for target 'demo' failed
make: *** [demo] Error 2
Uploading artifacts...
Runtime platform arch=386 os=linux pid=25745 revision=58272c27 version=12.7.0
WARNING: gl-code-quality-report.json: no matching files
ERROR: No files to upload
ERROR: Job failed: exit status 1
failed
test_tools Test Tools
tar: Child returned status 2
tar: Error is not recoverable: exiting now
Retrieving demo dataset, please be patient…
Makefile:7: recipe for target 'LIL-L4.fastq.gz' failed
make[1]: *** [LIL-L4.fastq.gz] Error 4
make[1]: Leaving directory '/home/gitlab-runner/builds/b8d876c1/0/vidjil/vidjil/demo'
Makefile:66: recipe for target 'demo' failed
make: *** [demo] Error 2
ERROR: Job failed: exit status 1