Mise à jour terminée. Pour connaître les apports de la version 13.8.4 par rapport à notre ancienne version vous pouvez lire les "Release Notes" suivantes :
https://about.gitlab.com/releases/2021/02/11/security-release-gitlab-13-8-4-released/
https://about.gitlab.com/releases/2021/02/05/gitlab-13-8-3-released/

tests server; add new function to get login user name and password

Also update functions that need it
add a new function 'create_user' to automaticaly create a new user
47 jobs for feature/monitor-app in 24 minutes and 33 seconds (queued for 9 seconds)
latest
Status Job ID Name Coverage
  Test Tools
passed #992754
test_tools

00:00:11

 
  Test Quality
failed #992758
allowed to fail
code_quality

00:00:05

passed #992760
web
code_quality_custom

00:00:12

 
  Test Unit
passed #992762
test_algo_unit

00:03:32

passed #992764
web
test_browser_unit

00:01:00

passed #992766
web
test_server_unit

00:00:18

 
  Test Functional
passed #992776
web
chrome-browser-functional

00:05:50

passed #992773
web
ff32-browser-functional

00:09:35

passed #992778
docker x86_64
ff32-server-functional

00:07:02

passed #992775
web
ff45-browser-functional

00:06:19

passed #992779
docker x86_64
ff45-server-functional

00:06:39

passed #992805
legacy
old-chrome-browser-functional

00:06:04

passed #992772
test_algo_should

00:09:23

failed #992804
legacy
old-chrome-browser-functional

00:06:30

failed #992777
legacy
old-chrome-browser-functional

00:06:27

 
  Test Tutorial
failed #992813
web-pandoc
chrome-browser-tutorial

00:00:29

failed #992811
web-pandoc
ff32-browser-tutorial

00:00:29

failed #992812
web-pandoc
ff45-browser-tutorial

00:00:33

failed #992810
legacy
old-chrome-browser-tutorial

00:00:30

failed #992809
web-pandoc
chrome-browser-tutorial

00:00:33

failed #992782
web-pandoc
chrome-browser-tutorial

00:00:29

failed #992806
web-pandoc
ff32-browser-tutorial

00:00:33

failed #992780
web-pandoc
ff32-browser-tutorial

00:00:31

failed #992781
web-pandoc
ff45-browser-tutorial

00:00:34

failed #992808
web-pandoc
ff45-browser-tutorial

00:00:29

failed #992807
legacy
old-chrome-browser-tutorial

00:00:30

failed #992783
legacy
old-chrome-browser-tutorial

00:00:30

 
  Test Shouldvdj
skipped #992784
test_algo_shouldvdj
 
  Test Functional External
skipped #992787
web
chrome-browser-functional-external
skipped #992785
web
ff32-browser-functional-external
skipped #992786
web
ff45-browser-functional-external
skipped #992788
legacy
old-chrome-browser-functional-external-chrome
 
  Coverage
skipped #992789
algo_coverage
 
  Valgrind Unit
skipped #992790
valgrind
algo_valgrind_unit
 
  Valgrind Functional
skipped #992791
valgrind allowed to fail manual
algo_valgrind_functional
 
  Multiple Tests
skipped #992799
cidocker allowed to fail manual
test_clang34_manual
skipped #992800
cidocker allowed to fail manual
test_clang4_manual
skipped #992801
cidocker allowed to fail manual
test_clang6_manual
skipped #992802
cidocker allowed to fail manual
test_clang7_manual
skipped #992798
cidocker allowed to fail manual
test_gcc10_manual
skipped #992792
cidocker allowed to fail manual
test_gcc48_manual
skipped #992793
cidocker allowed to fail manual
test_gcc5_manual
skipped #992794
cidocker allowed to fail manual
test_gcc6_manual
skipped #992795
cidocker allowed to fail manual
test_gcc7_manual
skipped #992796
cidocker allowed to fail manual
test_gcc8_manual
skipped #992797
cidocker allowed to fail manual
test_gcc9_manual
 
  Monitor App
skipped #992803
web
monitor_app
 
Name Stage Failure
failed
chrome-browser-tutorial Test Tutorial
make[1]: *** [tutorial] Error 1
make[1]: Leaving directory '/home/gitlab-runner/builds/ziJxcFPn/0/vidjil/vidjil/browser/test'
Makefile:22: recipe for target 'test_tutorial' failed
make: *** [test_tutorial] Error 2
Uploading artifacts...
Runtime platform arch=amd64 os=linux pid=24909 revision=58272c27 version=12.7.0
WARNING: browser/test/test/TEST-*.xml: no matching files
ERROR: No files to upload
ERROR: Job failed: exit status 1
failed
ff45-browser-tutorial Test Tutorial
Makefile:22: recipe for target 'test_tutorial' failed
make: *** [test_tutorial] Error 2
Running after_script
Uploading artifacts for failed job
Uploading artifacts...
Runtime platform
arch=amd64 os=linux pid=12053 revision=4c96e5ad version=12.9.0
WARNING: browser/test/test/TEST-*.xml: no matching files
ERROR: No files to upload
ERROR: Job failed: exit status 1
failed
ff32-browser-tutorial Test Tutorial
make[1]: *** [tutorial] Error 1
make[1]: Leaving directory '/home/gitlab-runner/builds/ziJxcFPn/0/vidjil/vidjil/browser/test'
Makefile:22: recipe for target 'test_tutorial' failed
make: *** [test_tutorial] Error 2
Uploading artifacts...
Runtime platform arch=amd64 os=linux pid=24009 revision=58272c27 version=12.7.0
WARNING: browser/test/test/TEST-*.xml: no matching files
ERROR: No files to upload
ERROR: Job failed: exit status 1
failed
old-chrome-browser-tutorial Test Tutorial
make[1]: *** [tutorial] Error 1
make[1]: Leaving directory '/home/gitlab-runner/builds/U7Q_BXuw/0/vidjil/vidjil/browser/test'
Makefile:22: recipe for target 'test_tutorial' failed
make: *** [test_tutorial] Error 2
Uploading artifacts...
Runtime platform arch=amd64 os=linux pid=16984 revision=4745a6f3 version=11.8.0
WARNING: browser/test/test/TEST-*.xml: no matching files
ERROR: No files to upload
ERROR: Job failed: exit status 1
failed
code_quality Test Quality
$ function propagate_env_vars() { # collapsed multi-line command
$ docker pull --quiet "$CODE_QUALITY_IMAGE"
unknown flag: --quiet
See 'docker pull --help'.
Uploading artifacts...
Runtime platform arch=386 os=linux pid=17586 revision=58272c27 version=12.7.0
WARNING: gl-code-quality-report.json: no matching files
ERROR: No files to upload
ERROR: Job failed: exit status 1