Attention une mise à jour du service Gitlab va être effectuée le mardi 18 janvier (et non lundi 17 comme annoncé précédemment) entre 18h00 et 18h30. Cette mise à jour va générer une interruption du service dont nous ne maîtrisons pas complètement la durée mais qui ne devrait pas excéder quelques minutes.

{scatterPlot,shortcut}.js : jshint corrections

Modifications in scatterPlot.js were already done but overwritten by merge
9 jobs for feature-c/test_multiple_selection in 3 minutes and 26 seconds (queued for 3 seconds)
Status Name Job ID Coverage
  Test Quality
failed code_quality #5631
allowed to fail

00:00:01

canceled code_quality #5629
allowed to fail

canceled code_quality #5628
allowed to fail

failed code_quality #5623
allowed to fail

00:00:01

 
  Test Unit
passed test_browser_unit #5624

00:00:02

 
  Test Functional
failed test_browser-functional #5630

00:03:22

canceled test_browser-functional #5625

00:02:51

 
  Deploy
canceled deploy #5626

canceled stop_deploy #5627
manual

 
Name Stage Failure
failed
test_browser-functional Test Functional There is an unknown failure, please try again
3 runs, 10 assertions, 0 failures, 0 errors, 0 skips

generating ci files
make[2]: *** [functional] Error 1
make[2]: Leaving directory `/home/gitlab_ci_multi_runner/builds/66984086/0/vidjil/vidjil/browser/test'
make[1]: *** [headless] Error 2
make[1]: Leaving directory `/home/gitlab_ci_multi_runner/builds/66984086/0/vidjil/vidjil/browser/test'
make: *** [headless_browser] Error 2
ERROR: Build failed: exit status 1
failed
code_quality Test Quality There is an unknown failure, please try again
germline/rattus-norvegicus/IGLJ_downstream.fa
germline/rattus-norvegicus/IGLJ.fa
germline/rattus-norvegicus/IGLV.fa
germline/IMGT_RELEASE
browser/js/germline.js
make[1]: Leaving directory `/home/gitlab_ci_multi_runner/builds/66984086/0/vidjil/vidjil/germline'
$ jshint browser/js/*.js
bash: line 52: jshint: command not found
ERROR: Build failed: exit status 1