tests: 7038-long-deletions.should-vdj.fa, now in BUG

see #3275
22 jobs for feature-a/4271-update-germlines in 3 minutes and 16 seconds (queued for 3 seconds)
latest
Status Job ID Name Coverage
  Test Tools
passed #965778
test_tools

00:00:11

 
  Test Quality
failed #965779
allowed to fail
code_quality

00:00:05

 
  Test Unit
failed #965780
test_algo_unit

00:02:59

 
  Test Functional
skipped #965781
test_algo_should
 
  Test Shouldvdj
skipped #965782
test_algo_shouldvdj
 
  Coverage
skipped #965783
algo_coverage
 
  Prepare Release
skipped #965784
allowed to fail manual
prepare_release
 
  Valgrind Unit
skipped #965785
valgrind
algo_valgrind_unit
 
  Valgrind Functional
skipped #965786
valgrind allowed to fail manual
algo_valgrind_functional
 
  Multiple Tests
skipped #965794
cidocker allowed to fail manual
test_clang34_manual
skipped #965795
cidocker allowed to fail manual
test_clang4_manual
skipped #965796
cidocker allowed to fail manual
test_clang6_manual
skipped #965797
cidocker allowed to fail manual
test_clang7_manual
skipped #965793
cidocker allowed to fail manual
test_gcc10_manual
skipped #965787
cidocker allowed to fail manual
test_gcc48_manual
skipped #965788
cidocker allowed to fail manual
test_gcc5_manual
skipped #965789
cidocker allowed to fail manual
test_gcc6_manual
skipped #965790
cidocker allowed to fail manual
test_gcc7_manual
skipped #965791
cidocker allowed to fail manual
test_gcc8_manual
skipped #965792
cidocker allowed to fail manual
test_gcc9_manual
 
  Benchmark
skipped #965799
cidocker allowed to fail manual
benchmark_algo
skipped #965798
cidocker allowed to fail manual
profiling_algo
 
Name Stage Failure
failed
test_algo_unit Test Unit
make[2]: *** [test] Aborted
make[2]: Leaving directory '/home/gitlab-runner/builds/b8d876c1/0/vidjil/vidjil/algo/tests'
Makefile:174: recipe for target 'unit' failed
make[1]: *** [unit] Error 2
make[1]: Leaving directory '/home/gitlab-runner/builds/b8d876c1/0/vidjil/vidjil/algo'
Makefile:209: recipe for target 'unit_coverage' failed
make: *** [unit_coverage] Error 2
make: Leaving directory '/home/gitlab-runner/builds/b8d876c1/0/vidjil/vidjil/algo'
ERROR: Job failed: exit status 1
failed
code_quality Test Quality
$ function propagate_env_vars() { # collapsed multi-line command
$ docker pull --quiet "$CODE_QUALITY_IMAGE"
unknown flag: --quiet
See 'docker pull --help'.
Uploading artifacts...
Runtime platform arch=386 os=linux pid=29393 revision=58272c27 version=12.7.0
WARNING: gl-code-quality-report.json: no matching files
ERROR: No files to upload
ERROR: Job failed: exit status 1