core/filter.cpp: modulo ~128 bins

We want to enable filtering when there are many genes.
see #4660
22 jobs for feature-a/4271-update-germlines in 3 minutes and 23 seconds (queued for 5 seconds)
Status Job ID Name Coverage
  Test Tools
passed #940131
test_tools

00:00:13

 
  Test Quality
failed #940132
allowed to fail
code_quality

00:00:05

 
  Test Unit
failed #940133
test_algo_unit

00:03:03

 
  Test Functional
skipped #940134
test_algo_should
 
  Test Shouldvdj
skipped #940135
test_algo_shouldvdj
 
  Coverage
skipped #940136
algo_coverage
 
  Prepare Release
skipped #940137
allowed to fail manual
prepare_release
 
  Valgrind Unit
skipped #940138
valgrind
algo_valgrind_unit
 
  Valgrind Functional
skipped #940139
valgrind allowed to fail manual
algo_valgrind_functional
 
  Multiple Tests
skipped #940147
cidocker allowed to fail manual
test_clang34_manual
skipped #940148
cidocker allowed to fail manual
test_clang4_manual
skipped #940149
cidocker allowed to fail manual
test_clang6_manual
skipped #940150
cidocker allowed to fail manual
test_clang7_manual
skipped #940146
cidocker allowed to fail manual
test_gcc10_manual
skipped #940140
cidocker allowed to fail manual
test_gcc48_manual
skipped #940141
cidocker allowed to fail manual
test_gcc5_manual
skipped #940142
cidocker allowed to fail manual
test_gcc6_manual
skipped #940143
cidocker allowed to fail manual
test_gcc7_manual
skipped #940144
cidocker allowed to fail manual
test_gcc8_manual
skipped #940145
cidocker allowed to fail manual
test_gcc9_manual
 
  Benchmark
skipped #940152
cidocker allowed to fail manual
benchmark_algo
skipped #940151
cidocker allowed to fail manual
profiling_algo
 
Name Stage Failure
failed
test_algo_unit Test Unit
make[2]: *** [test] Aborted
make[2]: Leaving directory '/home/gitlab-runner/builds/b8d876c1/0/vidjil/vidjil/algo/tests'
Makefile:174: recipe for target 'unit' failed
make[1]: *** [unit] Error 2
make[1]: Leaving directory '/home/gitlab-runner/builds/b8d876c1/0/vidjil/vidjil/algo'
Makefile:209: recipe for target 'unit_coverage' failed
make: *** [unit_coverage] Error 2
make: Leaving directory '/home/gitlab-runner/builds/b8d876c1/0/vidjil/vidjil/algo'
ERROR: Job failed: exit status 1
failed
code_quality Test Quality
$ function propagate_env_vars() { # collapsed multi-line command
$ docker pull --quiet "$CODE_QUALITY_IMAGE"
unknown flag: --quiet
See 'docker pull --help'.
Uploading artifacts...
Runtime platform arch=386 os=linux pid=9037 revision=58272c27 version=12.7.0
WARNING: gl-code-quality-report.json: no matching files
ERROR: No files to upload
ERROR: Job failed: exit status 1