tests/unit-tests/testFilter.cpp: filter should filter out most of the V genes

22 jobs for feature-a/4271-update-germlines in 3 minutes and 46 seconds (queued for 3 seconds)
Status Job ID Name Coverage
  Test Tools
passed #925308
test_tools

00:00:10

 
  Test Quality
failed #925309
allowed to fail
code_quality

00:00:05

 
  Test Unit
failed #925310
test_algo_unit

00:03:30

 
  Test Functional
skipped #925311
test_algo_should
 
  Test Shouldvdj
skipped #925312
test_algo_shouldvdj
 
  Coverage
skipped #925313
algo_coverage
 
  Prepare Release
skipped #925314
allowed to fail manual
prepare_release
 
  Valgrind Unit
skipped #925315
valgrind
algo_valgrind_unit
 
  Valgrind Functional
skipped #925316
valgrind allowed to fail manual
algo_valgrind_functional
 
  Multiple Tests
skipped #925324
cidocker allowed to fail manual
test_clang34_manual
skipped #925325
cidocker allowed to fail manual
test_clang4_manual
skipped #925326
cidocker allowed to fail manual
test_clang6_manual
skipped #925327
cidocker allowed to fail manual
test_clang7_manual
skipped #925323
cidocker allowed to fail manual
test_gcc10_manual
skipped #925317
cidocker allowed to fail manual
test_gcc48_manual
skipped #925318
cidocker allowed to fail manual
test_gcc5_manual
skipped #925319
cidocker allowed to fail manual
test_gcc6_manual
skipped #925320
cidocker allowed to fail manual
test_gcc7_manual
skipped #925321
cidocker allowed to fail manual
test_gcc8_manual
skipped #925322
cidocker allowed to fail manual
test_gcc9_manual
 
  Benchmark
skipped #925329
cidocker allowed to fail manual
benchmark_algo
skipped #925328
cidocker allowed to fail manual
profiling_algo
 
Name Stage Failure
failed
test_algo_unit Test Unit
make[2]: *** [test] Aborted
make[2]: Leaving directory '/home/gitlab-runner/builds/b8d876c1/0/vidjil/vidjil/algo/tests'
Makefile:174: recipe for target 'unit' failed
make[1]: *** [unit] Error 2
make[1]: Leaving directory '/home/gitlab-runner/builds/b8d876c1/0/vidjil/vidjil/algo'
Makefile:209: recipe for target 'unit_coverage' failed
make: *** [unit_coverage] Error 2
make: Leaving directory '/home/gitlab-runner/builds/b8d876c1/0/vidjil/vidjil/algo'
ERROR: Job failed: exit status 1
failed
code_quality Test Quality
$ function propagate_env_vars() { # collapsed multi-line command
$ docker pull --quiet "$CODE_QUALITY_IMAGE"
unknown flag: --quiet
See 'docker pull --help'.
Uploading artifacts...
Runtime platform arch=386 os=linux pid=16172 revision=58272c27 version=12.7.0
WARNING: gl-code-quality-report.json: no matching files
ERROR: No files to upload
ERROR: Job failed: exit status 1