core/automaton.hpp: cover when SEED_COVER

see #3342
19 jobs for feature-a/one-heuristic-multiple-affects in 4 minutes and 1 second (queued for 3 seconds)
latest
Status Job ID Name Coverage
  Test Tools
passed #919012
test_tools

00:00:10

 
  Test Unit
failed #919013
test_algo_unit

00:03:51

 
  Test Functional
skipped #919014
test_algo_should
 
  Test Shouldvdj
skipped #919015
test_algo_shouldvdj
 
  Coverage
skipped #919016
algo_coverage
 
  Prepare Release
skipped #919017
allowed to fail manual
prepare_release
 
  Valgrind Unit
skipped #919018
valgrind
algo_valgrind_unit
 
  Valgrind Functional
skipped #919019
valgrind allowed to fail manual
algo_valgrind_functional
 
  Multiple Tests
skipped #919026
cidocker allowed to fail manual
test_clang34_manual
skipped #919027
cidocker allowed to fail manual
test_clang4_manual
skipped #919028
cidocker allowed to fail manual
test_clang6_manual
skipped #919029
cidocker allowed to fail manual
test_clang7_manual
skipped #919020
cidocker allowed to fail manual
test_gcc48_manual
skipped #919021
cidocker allowed to fail manual
test_gcc5_manual
skipped #919022
cidocker allowed to fail manual
test_gcc6_manual
skipped #919023
cidocker allowed to fail manual
test_gcc7_manual
skipped #919024
cidocker allowed to fail manual
test_gcc8_manual
skipped #919025
cidocker allowed to fail manual
test_gcc9_manual
 
  Benchmark
skipped #919030
several-compilers allowed to fail manual
benchmark_algo
 
Name Stage Failure
failed
test_algo_unit Test Unit
make[2]: *** [test] Segmentation fault
make[2]: Leaving directory '/home/gitlab-runner/builds/b8d876c1/0/vidjil/vidjil/algo/tests'
Makefile:174: recipe for target 'unit' failed
make[1]: *** [unit] Error 2
make[1]: Leaving directory '/home/gitlab-runner/builds/b8d876c1/0/vidjil/vidjil/algo'
Makefile:209: recipe for target 'unit_coverage' failed
make: *** [unit_coverage] Error 2
make: Leaving directory '/home/gitlab-runner/builds/b8d876c1/0/vidjil/vidjil/algo'
ERROR: Job failed: exit status 1