Add test for clusterByV error fix

Link to #4495
16 jobs for feature-c/4495_clusterBy_and_distrib_clones in 1 minute and 33 seconds (queued for 2 seconds)
latest
Status Job ID Name Coverage
  Test Tools
passed #851144
test_tools

00:00:12

 
  Test Quality
failed #851145
allowed to fail
code_quality

00:00:05

passed #851146
web
code_quality_custom

00:00:11

 
  Test Unit
passed #851147
web
test_browser_unit

00:00:59

 
  Deploy Review
failed #872486
web
deploy_review

00:00:10

manual #851149
web allowed to fail manual
stop_deploy_review
failed #868711
web
deploy_review

00:00:09

failed #851148
web
deploy_review

00:00:10

 
  Test Functional
skipped #851152
web
chrome-browser-functional
skipped #851150
web
ff32-browser-functional
skipped #851151
web
ff45-browser-functional
skipped #851153
legacy
old-chrome-browser-functional
 
  Test Functional External
skipped #851156
web
chrome-browser-functional-external
skipped #851154
web
ff32-browser-functional-external
skipped #851155
web
ff45-browser-functional-external
skipped #851157
legacy
old-chrome-browser-functional-external-chrome
 
Name Stage Failure
failed
deploy_review Deploy Review
make[2]: *** [fontsave] Error 3
make[2]: Leaving directory '/home/gitlab-runner/builds/b8d876c1/0/vidjil/vidjil/browser/css/icons'
Makefile:6: recipe for target 'retrieve' failed
make[1]: *** [retrieve] Error 2
make[1]: Leaving directory '/home/gitlab-runner/builds/b8d876c1/0/vidjil/vidjil/browser/css/icons'
Makefile:10: recipe for target 'icons' failed
make: *** [icons] Error 2
make: Leaving directory '/home/gitlab-runner/builds/b8d876c1/0/vidjil/vidjil/browser'
ERROR: Job failed: exit status 1
failed
code_quality Test Quality
$ function propagate_env_vars() { # collapsed multi-line command
$ docker pull --quiet "$CODE_QUALITY_IMAGE"
unknown flag: --quiet
See 'docker pull --help'.
Uploading artifacts...
Runtime platform arch=386 os=linux pid=32044 revision=58272c27 version=12.7.0
WARNING: gl-code-quality-report.json: no matching files
ERROR: No files to upload
ERROR: Job failed: exit status 1