draft

22 jobs for feature-c/aligner in 29 minutes and 24 seconds (queued for 3 seconds)
latest
Status Job ID Name Coverage
  Test Tools
passed #847216
test_tools

00:00:10

 
  Test Quality
passed #847217
code_quality

00:02:34

passed #847218
web
code_quality_custom

00:00:11

 
  Test Unit
passed #847219
web
test_browser_unit

00:00:23

 
  Deploy Review
passed #847220
web
deploy_review

00:00:25

manual #847221
web allowed to fail manual
stop_deploy_review
 
  Test Functional
failed #847441
web
chrome-browser-functional

00:14:15

failed #847455
web
ff32-browser-functional

00:17:09

failed #847458
web
ff45-browser-functional

00:18:03

failed #847472
legacy
old-chrome-browser-functional

00:17:10

failed #847224
web
chrome-browser-functional

00:13:47

failed #847334
web
chrome-browser-functional

00:14:16

failed #847222
web
ff32-browser-functional

00:17:00

failed #847385
web
ff32-browser-functional

00:17:05

failed #847223
web
ff45-browser-functional

00:18:02

failed #847387
web
ff45-browser-functional

00:18:01

failed #847225
legacy
old-chrome-browser-functional

00:17:53

failed #847386
legacy
old-chrome-browser-functional

00:18:53

 
  Test Functional External
skipped #847228
web
chrome-browser-functional-external
skipped #847226
web
ff32-browser-functional-external
skipped #847227
web
ff45-browser-functional-external
skipped #847229
legacy
old-chrome-browser-functional-external-chrome
 
Name Stage Failure
failed
ff45-browser-functional Test Functional

Makefile:11: recipe for target 'functional' failed
make: *** [functional] Error 1
make: Leaving directory '/home/gitlab-runner/builds/ziJxcFPn/0/vidjil/vidjil/browser/test'
Uploading artifacts...
Runtime platform arch=amd64 os=linux pid=16390 revision=58272c27 version=12.7.0
browser/test/test/TEST-*.xml: found 11 matching files

Uploading artifacts to coordinator... ok
id=847458 responseStatus=201 Created token=o-3Jts1F
ERROR: Job failed: exit status 1
failed
old-chrome-browser-functional Test Functional

Makefile:11: recipe for target 'functional' failed
make: *** [functional] Error 1
make: Leaving directory '/home/gitlab-runner/builds/U7Q_BXuw/0/vidjil/vidjil/browser/test'
Uploading artifacts...
Runtime platform arch=amd64 os=linux pid=31610 revision=4745a6f3 version=11.8.0
browser/test/test/TEST-*.xml: found 11 matching files

Uploading artifacts to coordinator... ok
id=847472 responseStatus=201 Created token=3PBwWA1d
ERROR: Job failed: exit status 1
failed
ff32-browser-functional Test Functional

Makefile:11: recipe for target 'functional' failed
make: *** [functional] Error 1
make: Leaving directory '/home/gitlab-runner/builds/9103f1f5/0/vidjil/vidjil/browser/test'
Uploading artifacts...
Runtime platform arch=amd64 os=linux pid=25759 revision=58272c27 version=12.7.0
browser/test/test/TEST-*.xml: found 11 matching files

Uploading artifacts to coordinator... ok
id=847455 responseStatus=201 Created token=o9sQsuSy
ERROR: Job failed: exit status 1
failed
chrome-browser-functional Test Functional

Makefile:11: recipe for target 'functional' failed
make: *** [functional] Error 1
make: Leaving directory '/home/gitlab-runner/builds/b8d876c1/0/vidjil/vidjil/browser/test'
Uploading artifacts...
Runtime platform arch=386 os=linux pid=22293 revision=58272c27 version=12.7.0
browser/test/test/TEST-*.xml: found 11 matching files

Uploading artifacts to coordinator... ok
id=847441 responseStatus=201 Created token=oZbNcxNr
ERROR: Job failed: exit status 1