url.js : compatibility nightmare.js

require old school check for undefined object
33 jobs for feature-sc/nginx_conf_and_url in 79 minutes and 6 seconds (queued for 3 seconds)
Status Job ID Name Coverage
  Test Tools
passed #821783
test_tools

00:00:09

 
  Test Quality
failed #821784
allowed to fail
code_quality

00:00:02

passed #821785
web
code_quality_custom

00:00:11

 
  Test Unit
passed #821786
web
test_browser_unit

00:01:02

passed #821787
web
test_server_unit

00:00:16

 
  Deploy Review
passed #821788
web
deploy_review

00:00:27

passed #821789
deploy_review_server

00:03:46

manual #821790
web allowed to fail manual
stop_deploy_review
manual #821791
allowed to fail manual
stop_deploy_review_server
 
  Test Functional
failed #828350
web
chrome-browser-functional

00:32:26

failed #826941
web
ff32-browser-functional

00:33:35

passed #821796
docker x86_64
ff32-server-functional

00:07:02

failed #826942
web
ff45-browser-functional

00:33:37

passed #826943
x86_64 docker
ff45-server-functional

00:08:01

failed #826944
legacy
old-chrome-browser-functional

00:34:23

failed #826940
web
chrome-browser-functional

00:32:21

failed #821883
web
chrome-browser-functional

00:32:24

failed #821840
web
chrome-browser-functional

00:32:26

failed #821794
web
chrome-browser-functional

00:32:27

failed #821792
web
ff32-browser-functional

00:33:15

failed #821842
web
ff32-browser-functional

00:33:14

failed #821886
web
ff32-browser-functional

00:33:13

failed #821887
web
ff45-browser-functional

00:33:41

failed #821843
web
ff45-browser-functional

00:33:39

failed #821793
web
ff45-browser-functional

00:33:38

failed #821797
docker x86_64
ff45-server-functional

00:47:23

failed #821841
legacy
old-chrome-browser-functional

00:34:17

failed #821902
legacy
old-chrome-browser-functional

00:33:09

failed #821795
legacy
old-chrome-browser-functional

00:33:10

 
  Test Functional External
skipped #821800
web
chrome-browser-functional-external
skipped #821798
web
ff32-browser-functional-external
skipped #821799
web
ff45-browser-functional-external
skipped #821801
legacy
old-chrome-browser-functional-external-chrome
 
Name Stage Failure
failed
chrome-browser-functional Test Functional

Makefile:11: recipe for target 'functional' failed
make: *** [functional] Error 1
make: Leaving directory '/home/gitlab-runner/builds/b8d876c1/0/vidjil/vidjil/browser/test'
Uploading artifacts...
Runtime platform arch=386 os=linux pid=8725 revision=58272c27 version=12.7.0
browser/test/test/TEST-*.xml: found 11 matching files

Uploading artifacts to coordinator... ok
id=828350 responseStatus=201 Created token=S69opRgU
ERROR: Job failed: exit status 1
failed
old-chrome-browser-functional Test Functional

Makefile:11: recipe for target 'functional' failed
make: *** [functional] Error 1
make: Leaving directory '/home/gitlab-runner/builds/U7Q_BXuw/0/vidjil/vidjil/browser/test'
Uploading artifacts...
Runtime platform arch=amd64 os=linux pid=25148 revision=4745a6f3 version=11.8.0
browser/test/test/TEST-*.xml: found 11 matching files

Uploading artifacts to coordinator... ok
id=826944 responseStatus=201 Created token=AhzRcPdr
ERROR: Job failed: exit status 1
failed
ff45-browser-functional Test Functional

Makefile:11: recipe for target 'functional' failed
make: *** [functional] Error 1
make: Leaving directory '/home/gitlab-runner/builds/b8d876c1/0/vidjil/vidjil/browser/test'
Uploading artifacts...
Runtime platform arch=386 os=linux pid=23247 revision=58272c27 version=12.7.0
browser/test/test/TEST-*.xml: found 11 matching files

Uploading artifacts to coordinator... ok
id=826942 responseStatus=201 Created token=vRCdq9Xm
ERROR: Job failed: exit status 1
failed
ff32-browser-functional Test Functional

Makefile:11: recipe for target 'functional' failed
make: *** [functional] Error 1
make: Leaving directory '/home/gitlab-runner/builds/9103f1f5/0/vidjil/vidjil/browser/test'
Uploading artifacts...
Runtime platform arch=amd64 os=linux pid=23358 revision=58272c27 version=12.7.0
browser/test/test/TEST-*.xml: found 11 matching files

Uploading artifacts to coordinator... ok
id=826941 responseStatus=201 Created token=JSa2EuGr
ERROR: Job failed: exit status 1
failed
code_quality Test Quality
$ function propagate_env_vars() { # collapsed multi-line command
$ docker pull --quiet "$CODE_QUALITY_IMAGE"
unknown flag: --quiet
See 'docker pull --help'.
Uploading artifacts...
Runtime platform arch=386 os=linux pid=15392 revision=58272c27 version=12.7.0
WARNING: gl-code-quality-report.json: no matching files
ERROR: No files to upload
ERROR: Job failed: exit status 1