indexedDom : replace() function to swap indexed dom element

22 jobs for feature-c/aligner in 31 minutes and 1 second (queued for 2 seconds)
Status Job ID Name Coverage
  Test Tools
passed #816004
test_tools

00:00:09

 
  Test Quality
passed #816005
code_quality

00:03:34

passed #816006
web
code_quality_custom

00:00:12

 
  Test Unit
passed #816007
web
test_browser_unit

00:00:47

 
  Deploy Review
passed #816008
web
deploy_review

00:00:24

manual #816009
web allowed to fail manual
stop_deploy_review
 
  Test Functional
failed #816073
web
chrome-browser-functional

00:14:19

failed #816082
web
ff32-browser-functional

00:16:38

failed #816107
web
ff45-browser-functional

00:18:13

failed #816106
legacy
old-chrome-browser-functional

00:16:15

failed #816012
web
chrome-browser-functional

00:14:18

failed #816030
web
chrome-browser-functional

00:14:16

failed #816010
web
ff32-browser-functional

00:16:16

failed #816033
web
ff32-browser-functional

00:16:41

failed #816042
web
ff45-browser-functional

00:18:16

failed #816011
web
ff45-browser-functional

00:18:18

failed #816013
legacy
old-chrome-browser-functional

00:18:50

failed #816044
legacy
old-chrome-browser-functional

00:17:37

 
  Test Functional External
skipped #816016
web
chrome-browser-functional-external
skipped #816014
web
ff32-browser-functional-external
skipped #816015
web
ff45-browser-functional-external
skipped #816017
legacy
old-chrome-browser-functional-external-chrome
 
Name Stage Failure
failed
ff45-browser-functional Test Functional

Makefile:11: recipe for target 'functional' failed
make: *** [functional] Error 1
make: Leaving directory '/home/gitlab-runner/builds/ziJxcFPn/0/vidjil/vidjil/browser/test'
Uploading artifacts...
Runtime platform arch=amd64 os=linux pid=18208 revision=58272c27 version=12.7.0
browser/test/test/TEST-*.xml: found 11 matching files

Uploading artifacts to coordinator... ok
id=816107 responseStatus=201 Created token=p2bMrYCk
ERROR: Job failed: exit status 1
failed
old-chrome-browser-functional Test Functional

Makefile:11: recipe for target 'functional' failed
make: *** [functional] Error 1
make: Leaving directory '/home/gitlab-runner/builds/U7Q_BXuw/0/vidjil/vidjil/browser/test'
Uploading artifacts...
Runtime platform arch=amd64 os=linux pid=19915 revision=4745a6f3 version=11.8.0
browser/test/test/TEST-*.xml: found 11 matching files

Uploading artifacts to coordinator... ok
id=816106 responseStatus=201 Created token=cutsssVz
ERROR: Job failed: exit status 1
failed
ff32-browser-functional Test Functional

Makefile:11: recipe for target 'functional' failed
make: *** [functional] Error 1
make: Leaving directory '/home/gitlab-runner/builds/9103f1f5/0/vidjil/vidjil/browser/test'
Uploading artifacts...
Runtime platform arch=amd64 os=linux pid=15486 revision=58272c27 version=12.7.0
browser/test/test/TEST-*.xml: found 11 matching files

Uploading artifacts to coordinator... ok
id=816082 responseStatus=201 Created token=yrdaRRmD
ERROR: Job failed: exit status 1
failed
chrome-browser-functional Test Functional

Makefile:11: recipe for target 'functional' failed
make: *** [functional] Error 1
make: Leaving directory '/home/gitlab-runner/builds/b8d876c1/0/vidjil/vidjil/browser/test'
Uploading artifacts...
Runtime platform arch=386 os=linux pid=17589 revision=58272c27 version=12.7.0
browser/test/test/TEST-*.xml: found 11 matching files

Uploading artifacts to coordinator... ok
id=816073 responseStatus=201 Created token=wiaTzdXk
ERROR: Job failed: exit status 1