spike-normalization; Update fuse for better handling of MRD fields

Also update tests for it.
14 jobs for feature-ct/mrd_brasil_tool_and_client in 1 minute and 42 seconds (queued for 3 seconds)
Status Job ID Name Coverage
  Test Tools
passed #802043
test_tools

00:00:17

 
  Test Quality
failed #802044
allowed to fail
code_quality

00:00:03

passed #802045
web
code_quality_custom

00:00:10

 
  Test Unit
passed #802046
web
test_browser_unit

00:01:04

 
  Deploy Review
failed #802047
web
deploy_review

00:00:10

manual #802048
web allowed to fail manual
stop_deploy_review
 
  Test Functional
skipped #802051
web
chrome-browser-functional
skipped #802049
web
ff32-browser-functional
skipped #802050
web
ff45-browser-functional
skipped #802052
legacy
old-chrome-browser-functional
 
  Test Functional External
skipped #802055
web
chrome-browser-functional-external
skipped #802053
web
ff32-browser-functional-external
skipped #802054
web
ff45-browser-functional-external
skipped #802056
legacy
old-chrome-browser-functional-external-chrome
 
Name Stage Failure
failed
deploy_review Deploy Review
make[2]: *** [fontsave] Error 3
make[2]: Leaving directory '/home/gitlab-runner/builds/9103f1f5/0/vidjil/vidjil/browser/css/icons'
Makefile:6: recipe for target 'retrieve' failed
make[1]: *** [retrieve] Error 2
make[1]: Leaving directory '/home/gitlab-runner/builds/9103f1f5/0/vidjil/vidjil/browser/css/icons'
Makefile:10: recipe for target 'icons' failed
make: *** [icons] Error 2
make: Leaving directory '/home/gitlab-runner/builds/9103f1f5/0/vidjil/vidjil/browser'
ERROR: Job failed: exit status 1
failed
code_quality Test Quality
$ function propagate_env_vars() { # collapsed multi-line command
$ docker pull --quiet "$CODE_QUALITY_IMAGE"
unknown flag: --quiet
See 'docker pull --help'.
Uploading artifacts...
Runtime platform arch=386 os=linux pid=4956 revision=58272c27 version=12.7.0
WARNING: gl-code-quality-report.json: no matching files
ERROR: No files to upload
ERROR: Job failed: exit status 1