docker/CHANGELOG: new variable

see #4482
11 jobs for feature-s/4506-healthcare-compliance-warning in 7 minutes and 41 seconds (queued for 25 seconds)
Status Job ID Name Coverage
  Test Tools
passed #791920
test_tools

00:00:09

 
  Test Quality
failed #791921
allowed to fail
code_quality

00:00:04

 
  Test Unit
passed #791922
web
test_server_unit

00:00:18

 
  Deploy Review
failed #807138
deploy_review_server

00:00:10

manual #791924
allowed to fail manual
stop_deploy_review_server
passed #791923
deploy_review_server

00:00:08

 
  Test Functional
canceled #794147
x86_64 docker
ff32-server-functional

00:00:02

failed #794149
docker x86_64
ff45-server-functional

00:06:54

failed #791925
docker x86_64
ff32-server-functional

00:07:27

failed #794148
x86_64 docker
ff45-server-functional

00:00:41

failed #791926
docker x86_64
ff45-server-functional

00:07:51

 
Name Stage Failure
failed
deploy_review_server Deploy Review
make[2]: *** [fontsave] Error 3
make[2]: Leaving directory '/home/gitlab-runner/builds/ae9bf4d5/0/vidjil/vidjil/browser/css/icons'
Makefile:6: recipe for target 'retrieve' failed
make[1]: *** [retrieve] Error 2
make[1]: Leaving directory '/home/gitlab-runner/builds/ae9bf4d5/0/vidjil/vidjil/browser/css/icons'
Makefile:10: recipe for target 'icons' failed
make: *** [icons] Error 2
make: Leaving directory '/home/gitlab-runner/builds/ae9bf4d5/0/vidjil/vidjil/browser'
ERROR: Job failed: exit status 1
failed
ff45-server-functional Test Functional
Deleted: sha256:a34412e82500d8c620faaf010d2bed47833fc463b0ef510b1b7afcb77f4ddd8f
Deleted: sha256:e7b3a9873cad289028b52896f65086aa09b7864e6ce862eaf459b7977c9d51d0
Deleted: sha256:d239be2082e08217e868e19d44b45937992dddcd5808c8fa1a61047342a66bfe
Deleted: sha256:2b88129d54af5d484d95f4f624792ed476437cea8c1b0342c90d6fc064392ae1
Uploading artifacts...
Runtime platform arch=amd64 os=linux pid=22148 revision=58272c27 version=12.7.0
server/web2py/applications/vidjil/tests/test/TEST-*.xml: found 5 matching files

Uploading artifacts to coordinator... ok
id=794149 responseStatus=201 Created token=kAoc8UbY
ERROR: Job failed: exit status 1
failed
code_quality Test Quality
$ if ! docker info &>/dev/null; then # collapsed multi-line command
$ docker pull --quiet "$CODE_QUALITY_IMAGE"
unknown flag: --quiet
See 'docker pull --help'.
Uploading artifacts...
Runtime platform arch=386 os=linux pid=16251 revision=58272c27 version=12.7.0
WARNING: gl-code-quality-report.json: no matching files
ERROR: No files to upload
ERROR: Job failed: exit status 1