update segmenter page CSS

Link to #3988
23 jobs for feature-c/3988-saturation-barre-send-to in 15 minutes and 48 seconds (queued for 7 minutes and 36 seconds)
latest
Status Job ID Name Coverage
  Test Tools
passed #765116
test_tools

00:00:32

 
  Test Quality
passed #765117
web
code_quality

00:00:11

 
  Test Unit
passed #765118
web
test_browser_unit

00:00:47

 
  Deploy Review
passed #765119
web
deploy_review

00:00:26

manual #765120
web allowed to fail manual
stop_deploy_review
 
  Test Functional
passed #765123
web
chrome-browser-functional

00:04:27

passed #765121
web
ff32-browser-functional

00:04:24

passed #765122
web
ff45-browser-functional

00:05:18

passed #765175
legacy
old-chrome-browser-functional

00:04:52

failed #765160
legacy
old-chrome-browser-functional

00:05:27

failed #765124
legacy
old-chrome-browser-functional

00:05:49

 
  Test Functional External
failed #765208
web
chrome-browser-functional-external

00:02:38

failed #765206
web
ff32-browser-functional-external

00:02:14

failed #765205
web
ff45-browser-functional-external

00:02:17

failed #765209
legacy
old-chrome-browser-functional-external-chrome

00:02:44

failed #765197
web
chrome-browser-functional-external

00:02:36

failed #765127
web
chrome-browser-functional-external

00:02:39

failed #765125
web
ff32-browser-functional-external

00:02:15

failed #765195
web
ff32-browser-functional-external

00:02:15

failed #765126
web
ff45-browser-functional-external

00:02:17

failed #765196
web
ff45-browser-functional-external

00:02:09

failed #765128
legacy
old-chrome-browser-functional-external-chrome

00:02:43

failed #765198
legacy
old-chrome-browser-functional-external-chrome

00:02:38

 
Name Stage Failure
failed
old-chrome-browser-functional-external-chrome Test Functional External

Makefile:14: recipe for target 'external' failed
make: *** [external] Error 1
make: Leaving directory '/home/gitlab-runner/builds/U7Q_BXuw/0/vidjil/vidjil/browser/test'
Uploading artifacts...
Runtime platform arch=amd64 os=linux pid=3943 revision=4745a6f3 version=11.8.0
browser/test/test/TEST-*.xml: found 4 matching files

Uploading artifacts to coordinator... ok
id=765209 responseStatus=201 Created token=Y2vym94R
ERROR: Job failed: exit status 1
failed
chrome-browser-functional-external Test Functional External

Makefile:14: recipe for target 'external' failed
make: *** [external] Error 1
make: Leaving directory '/home/gitlab-runner/builds/9103f1f5/0/vidjil/vidjil/browser/test'
Uploading artifacts...
Runtime platform arch=amd64 os=linux pid=1176 revision=58272c27 version=12.7.0
browser/test/test/TEST-*.xml: found 4 matching files

Uploading artifacts to coordinator... ok
id=765208 responseStatus=201 Created token=HXU7ztkQ
ERROR: Job failed: exit status 1
failed
ff32-browser-functional-external Test Functional External

Makefile:14: recipe for target 'external' failed
make: *** [external] Error 1
make: Leaving directory '/home/gitlab-runner/builds/b8d876c1/0/vidjil/vidjil/browser/test'
Uploading artifacts...
Runtime platform arch=386 os=linux pid=8430 revision=58272c27 version=12.7.0
browser/test/test/TEST-*.xml: found 4 matching files

Uploading artifacts to coordinator... ok
id=765206 responseStatus=201 Created token=1dYPrcdH
ERROR: Job failed: exit status 1
failed
ff45-browser-functional-external Test Functional External

Makefile:14: recipe for target 'external' failed
make: *** [external] Error 1
make: Leaving directory '/home/gitlab-runner/builds/ziJxcFPn/0/vidjil/vidjil/browser/test'
Uploading artifacts...
Runtime platform arch=amd64 os=linux pid=9138 revision=58272c27 version=12.7.0
browser/test/test/TEST-*.xml: found 4 matching files

Uploading artifacts to coordinator... ok
id=765205 responseStatus=201 Created token=eiyx3FRt
ERROR: Job failed: exit status 1