Merge branch 'dev' into 'feature-c/4014-clones-selectionnable-even-if-disable'

# Conflicts:
#   browser/test/functional/test_scatterplot.rb
Status Job ID Name Coverage
  Test Tools
passed #761194
test_tools

00:00:09

 
  Test Quality
passed #761195
web
code_quality

00:00:21

 
  Test Unit
passed #761196
web
test_browser_unit

00:00:50

 
  Deploy Review
passed #761197
web
deploy_review

00:00:38

manual #761198
web allowed to fail manual
stop_deploy_review
 
  Test Functional
failed #761300
web
chrome-browser-functional

00:04:29

failed #761236
web
ff32-browser-functional

00:04:41

failed #761299
web
ff45-browser-functional

00:05:28

failed #761271
legacy
old-chrome-browser-functional

00:04:27

failed #761201
web
chrome-browser-functional

00:05:02

failed #761248
web
chrome-browser-functional

00:04:34

failed #761199
web
ff32-browser-functional

00:04:26

failed #761226
web
ff32-browser-functional

00:04:07

failed #761227
web
ff45-browser-functional

00:04:44

failed #761200
web
ff45-browser-functional

00:04:36

failed #761202
legacy
old-chrome-browser-functional

00:06:03

failed #761234
legacy
old-chrome-browser-functional

00:04:33

 
  Test Functional External
skipped #761205
web
chrome-browser-functional-external
skipped #761203
web
ff32-browser-functional-external
skipped #761204
web
ff45-browser-functional-external
skipped #761206
legacy
old-chrome-browser-functional-external-chrome
 
Name Stage Failure
failed
chrome-browser-functional Test Functional

Makefile:11: recipe for target 'functional' failed
make: *** [functional] Error 1
make: Leaving directory '/home/gitlab-runner/builds/b8d876c1/0/vidjil/vidjil/browser/test'
Uploading artifacts...
Runtime platform arch=386 os=linux pid=7701 revision=58272c27 version=12.7.0
browser/test/test/TEST-*.xml: found 10 matching files

Uploading artifacts to coordinator... ok
id=761300 responseStatus=201 Created token=Tvppwwk1
ERROR: Job failed: exit status 1
failed
ff45-browser-functional Test Functional

Makefile:11: recipe for target 'functional' failed
make: *** [functional] Error 1
make: Leaving directory '/home/gitlab-runner/builds/9103f1f5/0/vidjil/vidjil/browser/test'
Uploading artifacts...
Runtime platform arch=amd64 os=linux pid=7693 revision=58272c27 version=12.7.0
browser/test/test/TEST-*.xml: found 10 matching files

Uploading artifacts to coordinator... ok
id=761299 responseStatus=201 Created token=pQxmq-zr
ERROR: Job failed: exit status 1
failed
old-chrome-browser-functional Test Functional

Makefile:11: recipe for target 'functional' failed
make: *** [functional] Error 1
make: Leaving directory '/home/gitlab-runner/builds/U7Q_BXuw/0/vidjil/vidjil/browser/test'
Uploading artifacts...
Runtime platform arch=amd64 os=linux pid=400 revision=4745a6f3 version=11.8.0
browser/test/test/TEST-*.xml: found 10 matching files

Uploading artifacts to coordinator... ok
id=761271 responseStatus=201 Created token=C7P1wUxq
ERROR: Job failed: exit status 1
failed
ff32-browser-functional Test Functional

Makefile:11: recipe for target 'functional' failed
make: *** [functional] Error 1
make: Leaving directory '/home/gitlab-runner/builds/9103f1f5/0/vidjil/vidjil/browser/test'
Uploading artifacts...
Runtime platform arch=amd64 os=linux pid=5654 revision=58272c27 version=12.7.0
browser/test/test/TEST-*.xml: found 10 matching files

Uploading artifacts to coordinator... ok
id=761236 responseStatus=201 Created token=xk4yAp8m
ERROR: Job failed: exit status 1