first version of 'analyez with' menu

Create menu, populate it with previous content
Scroll DON'T work at the moment, so adding a new entrie will not be available
Status Job ID Name Coverage
  Test Tools
passed #760751
test_tools

00:00:10

 
  Test Quality
passed #760752
web
code_quality

00:00:10

 
  Test Unit
passed #760753
web
test_browser_unit

00:00:47

 
  Deploy Review
passed #760754
web
deploy_review

00:00:42

manual #760755
web allowed to fail manual
stop_deploy_review
 
  Test Functional
passed #760758
web
chrome-browser-functional

00:04:28

passed #760756
web
ff32-browser-functional

00:04:22

passed #760757
web
ff45-browser-functional

00:05:03

passed #760759
legacy
old-chrome-browser-functional

00:04:35

 
  Test Functional External
failed #760837
web
chrome-browser-functional-external

00:03:18

failed #760834
web
ff32-browser-functional-external

00:03:16

failed #760835
web
ff45-browser-functional-external

00:03:14

failed #760836
legacy
old-chrome-browser-functional-external-chrome

00:03:39

failed #760831
web
chrome-browser-functional-external

00:03:16

failed #760762
web
chrome-browser-functional-external

00:03:21

failed #760828
web
ff32-browser-functional-external

00:03:13

failed #760760
web
ff32-browser-functional-external

00:03:14

failed #760829
web
ff45-browser-functional-external

00:03:18

failed #760761
web
ff45-browser-functional-external

00:03:15

failed #760763
legacy
old-chrome-browser-functional-external-chrome

00:03:20

failed #760830
legacy
old-chrome-browser-functional-external-chrome

00:05:14

 
Name Stage Failure
failed
chrome-browser-functional-external Test Functional External

Makefile:14: recipe for target 'external' failed
make: *** [external] Error 1
make: Leaving directory '/home/gitlab-runner/builds/b8d876c1/0/vidjil/vidjil/browser/test'
Uploading artifacts...
Runtime platform arch=386 os=linux pid=23650 revision=58272c27 version=12.7.0
browser/test/test/TEST-*.xml: found 4 matching files

Uploading artifacts to coordinator... ok
id=760837 responseStatus=201 Created token=v3dt_Vwd
ERROR: Job failed: exit status 1
failed
ff45-browser-functional-external Test Functional External

Makefile:14: recipe for target 'external' failed
make: *** [external] Error 1
make: Leaving directory '/home/gitlab-runner/builds/ziJxcFPn/0/vidjil/vidjil/browser/test'
Uploading artifacts...
Runtime platform arch=amd64 os=linux pid=4046 revision=58272c27 version=12.7.0
browser/test/test/TEST-*.xml: found 4 matching files

Uploading artifacts to coordinator... ok
id=760835 responseStatus=201 Created token=wbRxEUwY
ERROR: Job failed: exit status 1
failed
old-chrome-browser-functional-external-chrome Test Functional External

Makefile:14: recipe for target 'external' failed
make: *** [external] Error 1
make: Leaving directory '/home/gitlab-runner/builds/U7Q_BXuw/0/vidjil/vidjil/browser/test'
Uploading artifacts...
Runtime platform arch=amd64 os=linux pid=24324 revision=4745a6f3 version=11.8.0
browser/test/test/TEST-*.xml: found 4 matching files

Uploading artifacts to coordinator... ok
id=760836 responseStatus=201 Created token=naUVQKN2
ERROR: Job failed: exit status 1
failed
ff32-browser-functional-external Test Functional External

Makefile:14: recipe for target 'external' failed
make: *** [external] Error 1
make: Leaving directory '/home/gitlab-runner/builds/9103f1f5/0/vidjil/vidjil/browser/test'
Uploading artifacts...
Runtime platform arch=amd64 os=linux pid=12730 revision=58272c27 version=12.7.0
browser/test/test/TEST-*.xml: found 4 matching files

Uploading artifacts to coordinator... ok
id=760834 responseStatus=201 Created token=U-hzyoUQ
ERROR: Job failed: exit status 1