graph.js; fix code quality (jslint)

Lik to #4370
21 jobs for feature-c/4370-label-tooltip-graph in 11 minutes and 11 seconds (queued for 3 seconds)
latest
Status Job ID Name Coverage
  Test Tools
passed #694885
test_tools

00:00:09

 
  Test Quality
passed #694886
web
code_quality

00:00:12

 
  Test Unit
passed #694887
web
test_browser_unit

00:00:22

 
  Deploy Review
passed #694888
web
deploy_review

00:00:17

manual #694889
web allowed to fail manual
stop_deploy_review
 
  Test Functional
failed #694917
web
chrome-browser-functional

00:04:05

failed #694910
web
ff32-browser-functional

00:03:42

failed #694916
web
ff45-browser-functional

00:04:18

failed #694911
legacy
old-chrome-browser-functional

00:05:33

failed #694909
web
chrome-browser-functional

00:03:52

failed #694892
web
chrome-browser-functional

00:03:54

failed #694906
web
ff32-browser-functional

00:03:46

failed #694890
web
ff32-browser-functional

00:03:40

failed #694891
web
ff45-browser-functional

00:04:20

failed #694907
web
ff45-browser-functional

00:04:14

failed #694908
legacy
old-chrome-browser-functional

00:03:44

failed #694893
legacy
old-chrome-browser-functional

00:05:47

 
  Test Functional External
skipped #694896
web
chrome-browser-functional-external
skipped #694894
web
ff32-browser-functional-external
skipped #694895
web
ff45-browser-functional-external
skipped #694897
legacy
old-chrome-browser-functional-external-chrome
 
Name Stage Failure
failed
chrome-browser-functional Test Functional

Makefile:11: recipe for target 'functional' failed
make: *** [functional] Error 1
make: Leaving directory '/home/gitlab-runner/builds/ziJxcFPn/0/vidjil/vidjil/browser/test'
Uploading artifacts...
Runtime platform arch=amd64 os=linux pid=32608 revision=58272c27 version=12.7.0
browser/test/test/TEST-*.xml: found 10 matching files

Uploading artifacts to coordinator... ok
id=694917 responseStatus=201 Created token=h4Kxdf7u
ERROR: Job failed: exit status 1
failed
ff45-browser-functional Test Functional

Makefile:11: recipe for target 'functional' failed
make: *** [functional] Error 1
make: Leaving directory '/home/gitlab-runner/builds/b8d876c1/0/vidjil/vidjil/browser/test'
Uploading artifacts...
Runtime platform arch=386 os=linux pid=23817 revision=58272c27 version=12.7.0
browser/test/test/TEST-*.xml: found 10 matching files

Uploading artifacts to coordinator... ok
id=694916 responseStatus=201 Created token=YuAMiU3N
ERROR: Job failed: exit status 1
failed
ff32-browser-functional Test Functional

Makefile:11: recipe for target 'functional' failed
make: *** [functional] Error 1
make: Leaving directory '/home/gitlab-runner/builds/ziJxcFPn/0/vidjil/vidjil/browser/test'
Uploading artifacts...
Runtime platform arch=amd64 os=linux pid=28729 revision=58272c27 version=12.7.0
browser/test/test/TEST-*.xml: found 10 matching files

Uploading artifacts to coordinator... ok
id=694910 responseStatus=201 Created token=fjcNxYtW
ERROR: Job failed: exit status 1
failed
old-chrome-browser-functional Test Functional

Makefile:11: recipe for target 'functional' failed
make: *** [functional] Error 1
make: Leaving directory '/home/gitlab-runner/builds/U7Q_BXuw/0/vidjil/vidjil/browser/test'
Uploading artifacts...
Runtime platform arch=amd64 os=linux pid=31618 revision=4745a6f3 version=11.8.0
browser/test/test/TEST-*.xml: found 10 matching files

Uploading artifacts to coordinator... ok
id=694911 responseStatus=201 Created token=WMzebmuS
ERROR: Job failed: exit status 1