model.js : filter should be applied on all clones not only the visibles ones

21 jobs for feature-c/4377-apply-focusFilter-on-all-clones in 11 minutes and 37 seconds (queued for 1 second)
latest
Status Job ID Name Coverage
  Test Tools
passed #692382
test_tools

00:00:19

 
  Test Quality
passed #692383
web
code_quality

00:00:10

 
  Test Unit
passed #692384
web
test_browser_unit

00:00:48

 
  Deploy Review
passed #692385
web
deploy_review

00:00:25

manual #692386
web allowed to fail manual
stop_deploy_review
 
  Test Functional
failed #692412
web
chrome-browser-functional

00:03:56

failed #692406
web
ff32-browser-functional

00:03:39

failed #692411
web
ff45-browser-functional

00:04:20

failed #692407
legacy
old-chrome-browser-functional

00:04:34

failed #692405
web
chrome-browser-functional

00:03:52

failed #692389
web
chrome-browser-functional

00:03:52

failed #692401
web
ff32-browser-functional

00:03:48

failed #692387
web
ff32-browser-functional

00:03:36

failed #692388
web
ff45-browser-functional

00:04:17

failed #692402
web
ff45-browser-functional

00:04:12

failed #692403
legacy
old-chrome-browser-functional

00:04:18

failed #692390
legacy
old-chrome-browser-functional

00:05:03

 
  Test Functional External
skipped #692393
web
chrome-browser-functional-external
skipped #692391
web
ff32-browser-functional-external
skipped #692392
web
ff45-browser-functional-external
skipped #692394
legacy
old-chrome-browser-functional-external-chrome
 
Name Stage Failure
failed
chrome-browser-functional Test Functional

Makefile:11: recipe for target 'functional' failed
make: *** [functional] Error 1
make: Leaving directory '/home/gitlab-runner/builds/ziJxcFPn/0/vidjil/vidjil/browser/test'
Uploading artifacts...
Runtime platform arch=amd64 os=linux pid=22647 revision=58272c27 version=12.7.0
browser/test/test/TEST-*.xml: found 10 matching files

Uploading artifacts to coordinator... ok
id=692412 responseStatus=201 Created token=HhrxgxYx
ERROR: Job failed: exit status 1
failed
ff45-browser-functional Test Functional

Makefile:11: recipe for target 'functional' failed
make: *** [functional] Error 1
make: Leaving directory '/home/gitlab-runner/builds/b8d876c1/0/vidjil/vidjil/browser/test'
Uploading artifacts...
Runtime platform arch=386 os=linux pid=24155 revision=58272c27 version=12.7.0
browser/test/test/TEST-*.xml: found 10 matching files

Uploading artifacts to coordinator... ok
id=692411 responseStatus=201 Created token=FAy_Phsk
ERROR: Job failed: exit status 1
failed
ff32-browser-functional Test Functional

Makefile:11: recipe for target 'functional' failed
make: *** [functional] Error 1
make: Leaving directory '/home/gitlab-runner/builds/ziJxcFPn/0/vidjil/vidjil/browser/test'
Uploading artifacts...
Runtime platform arch=amd64 os=linux pid=18437 revision=58272c27 version=12.7.0
browser/test/test/TEST-*.xml: found 10 matching files

Uploading artifacts to coordinator... ok
id=692406 responseStatus=201 Created token=wbQiFfx4
ERROR: Job failed: exit status 1
failed
old-chrome-browser-functional Test Functional

Makefile:11: recipe for target 'functional' failed
make: *** [functional] Error 1
make: Leaving directory '/home/gitlab-runner/builds/U7Q_BXuw/0/vidjil/vidjil/browser/test'
Uploading artifacts...
Runtime platform arch=amd64 os=linux pid=20572 revision=4745a6f3 version=11.8.0
browser/test/test/TEST-*.xml: found 10 matching files

Uploading artifacts to coordinator... ok
id=692407 responseStatus=201 Created token=fbGaS3Ei
ERROR: Job failed: exit status 1