Revert "Add 2 new sequences for tests on issue #4267"

This reverts commit 3598f91c.
20 jobs for feature-a/4267-too-short-D in 32 minutes and 37 seconds (queued for 23 minutes and 11 seconds)
latest
Status Job ID Name Coverage
  Test Tools
passed #690023
test_tools

00:00:09

 
  Test Unit
passed #690024
test_algo_unit

00:03:27

 
  Test Functional
passed #690025
test_algo_should

00:09:15

 
  Test Shouldvdj
failed #690026
test_algo_shouldvdj

00:19:44

 
  Coverage
skipped #690027
algo_coverage
 
  Prepare Release
skipped #690028
allowed to fail manual
prepare_release
 
  Valgrind Unit
skipped #690029
valgrind
algo_valgrind_unit
 
  Valgrind Functional
skipped #690030
valgrind allowed to fail manual
algo_valgrind_functional
 
  Multiple Tests
skipped #690037
cidocker allowed to fail manual
test_clang34_manual
skipped #690038
cidocker allowed to fail manual
test_clang4_manual
skipped #690039
cidocker allowed to fail manual
test_clang6_manual
skipped #690040
cidocker allowed to fail manual
test_clang7_manual
skipped #690031
cidocker allowed to fail manual
test_gcc48_manual
skipped #690032
cidocker allowed to fail manual
test_gcc5_manual
skipped #690033
cidocker allowed to fail manual
test_gcc6_manual
skipped #690034
cidocker allowed to fail manual
test_gcc7_manual
skipped #690035
cidocker allowed to fail manual
test_gcc8_manual
skipped #690036
cidocker allowed to fail manual
test_gcc9_manual
 
  Benchmark
skipped #690042
cidocker allowed to fail manual
benchmark_algo
skipped #690041
cidocker allowed to fail manual
profiling_algo
 
Name Stage Failure
failed
test_algo_shouldvdj Test Shouldvdj
make[2]: *** [shouldvdj_if_python] Error 2
make[2]: Leaving directory '/home/gitlab-runner/builds/b8d876c1/0/vidjil/vidjil/algo/tests'
Makefile:191: recipe for target 'shouldvdj' failed
make[1]: *** [shouldvdj] Error 2
make[1]: Leaving directory '/home/gitlab-runner/builds/b8d876c1/0/vidjil/vidjil/algo'
Makefile:215: recipe for target 'shouldvdj_coverage' failed
make: *** [shouldvdj_coverage] Error 2
make: Leaving directory '/home/gitlab-runner/builds/b8d876c1/0/vidjil/vidjil/algo'
ERROR: Job failed: exit status 1