algo/tests; add alignment for 2 sequences with D that appear since the last release

Link to #4267
20 jobs for feature-a/4267-too-short-D in 30 minutes and 1 second (queued for 3 seconds)
Status Job ID Name Coverage
  Test Tools
passed #689922
test_tools

00:00:15

 
  Test Unit
passed #689923
test_algo_unit

00:03:20

 
  Test Functional
passed #689924
test_algo_should

00:07:58

 
  Test Shouldvdj
failed #689925
test_algo_shouldvdj

00:18:27

 
  Coverage
skipped #689926
algo_coverage
 
  Prepare Release
skipped #689927
allowed to fail manual
prepare_release
 
  Valgrind Unit
skipped #689928
valgrind
algo_valgrind_unit
 
  Valgrind Functional
skipped #689929
valgrind allowed to fail manual
algo_valgrind_functional
 
  Multiple Tests
skipped #689936
cidocker allowed to fail manual
test_clang34_manual
skipped #689937
cidocker allowed to fail manual
test_clang4_manual
skipped #689938
cidocker allowed to fail manual
test_clang6_manual
skipped #689939
cidocker allowed to fail manual
test_clang7_manual
skipped #689930
cidocker allowed to fail manual
test_gcc48_manual
skipped #689931
cidocker allowed to fail manual
test_gcc5_manual
skipped #689932
cidocker allowed to fail manual
test_gcc6_manual
skipped #689933
cidocker allowed to fail manual
test_gcc7_manual
skipped #689934
cidocker allowed to fail manual
test_gcc8_manual
skipped #689935
cidocker allowed to fail manual
test_gcc9_manual
 
  Benchmark
skipped #689941
cidocker allowed to fail manual
benchmark_algo
skipped #689940
cidocker allowed to fail manual
profiling_algo
 
Name Stage Failure
failed
test_algo_shouldvdj Test Shouldvdj
make[2]: *** [shouldvdj_if_python] Error 2
make[2]: Leaving directory '/home/gitlab-runner/builds/ae9bf4d5/0/vidjil/vidjil/algo/tests'
Makefile:191: recipe for target 'shouldvdj' failed
make[1]: *** [shouldvdj] Error 2
make[1]: Leaving directory '/home/gitlab-runner/builds/ae9bf4d5/0/vidjil/vidjil/algo'
Makefile:215: recipe for target 'shouldvdj_coverage' failed
make: *** [shouldvdj_coverage] Error 2
make: Leaving directory '/home/gitlab-runner/builds/ae9bf4d5/0/vidjil/vidjil/algo'
ERROR: Job failed: exit status 1