Add 2 new sequences for tests on issue #4267

20 jobs for feature-a/4267-too-short-D in 30 minutes and 24 seconds (queued for 2 seconds)
Status Job ID Name Coverage
  Test Tools
passed #689014
test_tools

00:00:13

 
  Test Unit
passed #689015
test_algo_unit

00:03:16

 
  Test Functional
passed #689016
test_algo_should

00:08:20

 
  Test Shouldvdj
failed #689017
test_algo_shouldvdj

00:18:34

 
  Coverage
skipped #689018
algo_coverage
 
  Prepare Release
skipped #689019
allowed to fail manual
prepare_release
 
  Valgrind Unit
skipped #689020
valgrind
algo_valgrind_unit
 
  Valgrind Functional
skipped #689021
valgrind allowed to fail manual
algo_valgrind_functional
 
  Multiple Tests
skipped #689028
cidocker allowed to fail manual
test_clang34_manual
skipped #689029
cidocker allowed to fail manual
test_clang4_manual
skipped #689030
cidocker allowed to fail manual
test_clang6_manual
skipped #689031
cidocker allowed to fail manual
test_clang7_manual
skipped #689022
cidocker allowed to fail manual
test_gcc48_manual
skipped #689023
cidocker allowed to fail manual
test_gcc5_manual
skipped #689024
cidocker allowed to fail manual
test_gcc6_manual
skipped #689025
cidocker allowed to fail manual
test_gcc7_manual
skipped #689026
cidocker allowed to fail manual
test_gcc8_manual
skipped #689027
cidocker allowed to fail manual
test_gcc9_manual
 
  Benchmark
skipped #689033
cidocker allowed to fail manual
benchmark_algo
skipped #689032
cidocker allowed to fail manual
profiling_algo
 
Name Stage Failure
failed
test_algo_shouldvdj Test Shouldvdj
make[2]: *** [shouldvdj_if_python] Error 2
make[2]: Leaving directory '/home/gitlab-runner/builds/ae9bf4d5/0/vidjil/vidjil/algo/tests'
Makefile:191: recipe for target 'shouldvdj' failed
make[1]: *** [shouldvdj] Error 2
make[1]: Leaving directory '/home/gitlab-runner/builds/ae9bf4d5/0/vidjil/vidjil/algo'
Makefile:215: recipe for target 'shouldvdj_coverage' failed
make: *** [shouldvdj_coverage] Error 2
make: Leaving directory '/home/gitlab-runner/builds/ae9bf4d5/0/vidjil/vidjil/algo'
ERROR: Job failed: exit status 1