index.html: Allow the slider to go to 1 and move it by step of 1

Otherwise once we have been to 1 we can't go to 100.

Fix #4256
21 jobs for feature-c/4256-top-1 in 10 minutes and 17 seconds (queued for 3 seconds)
latest
Status Job ID Name Coverage
  Test Tools
passed #687132
test_tools

00:00:09

 
  Test Quality
passed #687133
web
code_quality

00:00:10

 
  Test Unit
passed #687134
web
test_browser_unit

00:00:22

 
  Deploy Review
passed #687135
web
deploy_review

00:00:22

manual #687136
web allowed to fail manual
stop_deploy_review
 
  Test Functional
failed #687156
web
chrome-browser-functional

00:03:40

failed #687150
web
ff32-browser-functional

00:03:39

failed #687153
web
ff45-browser-functional

00:04:27

failed #687151
legacy
old-chrome-browser-functional

00:05:40

failed #687149
web
chrome-browser-functional

00:03:48

failed #687139
web
chrome-browser-functional

00:03:42

failed #687145
web
ff32-browser-functional

00:03:55

failed #687137
web
ff32-browser-functional

00:03:40

failed #687138
web
ff45-browser-functional

00:04:28

failed #687147
web
ff45-browser-functional

00:04:11

failed #687146
legacy
old-chrome-browser-functional

00:05:37

failed #687140
legacy
old-chrome-browser-functional

00:04:10

 
  Test Functional External
skipped #687143
web
chrome-browser-functional-external
skipped #687141
web
ff32-browser-functional-external
skipped #687142
web
ff45-browser-functional-external
skipped #687144
legacy
old-chrome-browser-functional-external-chrome
 
Name Stage Failure
failed
chrome-browser-functional Test Functional

Makefile:11: recipe for target 'functional' failed
make: *** [functional] Error 1
make: Leaving directory '/home/gitlab-runner/builds/ziJxcFPn/0/vidjil/vidjil/browser/test'
Uploading artifacts...
Runtime platform arch=amd64 os=linux pid=4527 revision=58272c27 version=12.7.0
browser/test/test/TEST-*.xml: found 10 matching files

Uploading artifacts to coordinator... ok
id=687156 responseStatus=201 Created token=qJ6e8men
ERROR: Job failed: exit status 1
failed
ff45-browser-functional Test Functional

Makefile:11: recipe for target 'functional' failed
make: *** [functional] Error 1
make: Leaving directory '/home/gitlab-runner/builds/b8d876c1/0/vidjil/vidjil/browser/test'
Uploading artifacts...
Runtime platform arch=386 os=linux pid=18803 revision=58272c27 version=12.7.0
browser/test/test/TEST-*.xml: found 10 matching files

Uploading artifacts to coordinator... ok
id=687153 responseStatus=201 Created token=8GztxaNY
ERROR: Job failed: exit status 1
failed
old-chrome-browser-functional Test Functional

Makefile:11: recipe for target 'functional' failed
make: *** [functional] Error 1
make: Leaving directory '/home/gitlab-runner/builds/U7Q_BXuw/0/vidjil/vidjil/browser/test'
Uploading artifacts...
Runtime platform arch=amd64 os=linux pid=29881 revision=4745a6f3 version=11.8.0
browser/test/test/TEST-*.xml: found 10 matching files

Uploading artifacts to coordinator... ok
id=687151 responseStatus=201 Created token=V5eKPuCW
ERROR: Job failed: exit status 1
failed
ff32-browser-functional Test Functional

Makefile:11: recipe for target 'functional' failed
make: *** [functional] Error 1
make: Leaving directory '/home/gitlab-runner/builds/ziJxcFPn/0/vidjil/vidjil/browser/test'
Uploading artifacts...
Runtime platform arch=amd64 os=linux pid=613 revision=58272c27 version=12.7.0
browser/test/test/TEST-*.xml: found 10 matching files

Uploading artifacts to coordinator... ok
id=687150 responseStatus=201 Created token=m5swQrGz
ERROR: Job failed: exit status 1