model_loader; add test for load analysis and stock_order usage

Link to #4354
Status Job ID Name Coverage
  Test Tools
passed #686757
test_tools

00:00:09

 
  Test Quality
passed #686758
web
code_quality

00:00:10

 
  Test Unit
passed #686759
web
test_browser_unit

00:00:49

 
  Deploy Review
passed #686760
web
deploy_review

00:00:19

manual #686761
web allowed to fail manual
stop_deploy_review
 
  Test Functional
failed #686815
web
chrome-browser-functional

00:03:47

failed #686800
web
ff32-browser-functional

00:03:37

failed #686816
web
ff45-browser-functional

00:04:06

failed #686807
legacy
old-chrome-browser-functional

00:05:16

failed #686764
web
chrome-browser-functional

00:03:48

failed #686799
web
chrome-browser-functional

00:03:48

failed #686762
web
ff32-browser-functional

00:03:38

failed #686793
web
ff32-browser-functional

00:03:34

failed #686763
web
ff45-browser-functional

00:04:09

failed #686795
web
ff45-browser-functional

00:04:16

failed #686794
legacy
old-chrome-browser-functional

00:04:02

failed #686765
legacy
old-chrome-browser-functional

00:03:45

 
  Test Functional External
skipped #686768
web
chrome-browser-functional-external
skipped #686766
web
ff32-browser-functional-external
skipped #686767
web
ff45-browser-functional-external
skipped #686769
legacy
old-chrome-browser-functional-external-chrome
 
Name Stage Failure
failed
ff45-browser-functional Test Functional

Makefile:11: recipe for target 'functional' failed
make: *** [functional] Error 1
make: Leaving directory '/home/gitlab-runner/builds/ziJxcFPn/0/vidjil/vidjil/browser/test'
Uploading artifacts...
Runtime platform arch=amd64 os=linux pid=10158 revision=58272c27 version=12.7.0
browser/test/test/TEST-*.xml: found 10 matching files

Uploading artifacts to coordinator... ok
id=686816 responseStatus=201 Created token=RstiHNwv
ERROR: Job failed: exit status 1
failed
chrome-browser-functional Test Functional

Makefile:11: recipe for target 'functional' failed
make: *** [functional] Error 1
make: Leaving directory '/home/gitlab-runner/builds/b8d876c1/0/vidjil/vidjil/browser/test'
Uploading artifacts...
Runtime platform arch=386 os=linux pid=8533 revision=58272c27 version=12.7.0
browser/test/test/TEST-*.xml: found 10 matching files

Uploading artifacts to coordinator... ok
id=686815 responseStatus=201 Created token=ZJJTWp6w
ERROR: Job failed: exit status 1
failed
ff32-browser-functional Test Functional

Makefile:11: recipe for target 'functional' failed
make: *** [functional] Error 1
make: Leaving directory '/home/gitlab-runner/builds/ziJxcFPn/0/vidjil/vidjil/browser/test'
Uploading artifacts...
Runtime platform arch=amd64 os=linux pid=8379 revision=58272c27 version=12.7.0
browser/test/test/TEST-*.xml: found 10 matching files

Uploading artifacts to coordinator... ok
id=686800 responseStatus=201 Created token=Tx44K6DW
ERROR: Job failed: exit status 1
failed
old-chrome-browser-functional Test Functional

Makefile:11: recipe for target 'functional' failed
make: *** [functional] Error 1
make: Leaving directory '/home/gitlab-runner/builds/U7Q_BXuw/0/vidjil/vidjil/browser/test'
Uploading artifacts...
Runtime platform arch=amd64 os=linux pid=32101 revision=4745a6f3 version=11.8.0
browser/test/test/TEST-*.xml: found 10 matching files

Uploading artifacts to coordinator... ok
id=686807 responseStatus=201 Created token=RXGR5Hgo
ERROR: Job failed: exit status 1