/Makefile: we do not need anymore these jobs

towards #1491
27 jobs for feature-cs/4315-separate-external-qunit-stage in 30 minutes and 39 seconds (queued for 5 seconds)
latest
Status Job ID Name Coverage
  Test Tools
passed #675843
test_tools

00:00:09

 
  Test Quality
passed #675844
web
code_quality

00:00:12

 
  Test Unit
passed #675845
web
client-unit

00:00:47

passed #675846
web
test_server_unit

00:00:18

 
  Deploy Review
passed #675847
web
deploy_review

00:00:19

passed #675848
deploy_review_server

00:01:18

manual #675849
web allowed to fail manual
stop_deploy_review
failed #675850
allowed to fail manual
stop_deploy_review_server

 
  Test Functional
passed #675853
web
chrome-browser-functional

00:03:55

passed #675851
web
ff32-browser-functional

00:03:39

passed #675855
docker x86_64
ff32-server-functional

00:06:23

passed #675852
web
ff45-browser-functional

00:04:38

passed #675856
docker x86_64
ff45-server-functional

00:06:14

passed #675854
legacy
old-chrome-browser-functional

00:04:10

 
  Test External
failed #675934
web
chrome-browser-functional-external

00:04:42

passed #675857
web
client-unit-external

00:00:46

failed #675928
web
ff32-browser-functional-external

00:04:54

failed #675933
web
ff45-browser-functional-external

00:05:08

failed #675909
legacy
old-chrome-browser-functional-external-chrome

00:04:54

failed #675908
web
chrome-browser-functional-external

00:04:41

failed #675860
web
chrome-browser-functional-external

00:04:43

failed #675902
web
ff32-browser-functional-external

00:04:54

failed #675858
web
ff32-browser-functional-external

00:04:53

failed #675859
web
ff45-browser-functional-external

00:05:06

failed #675904
web
ff45-browser-functional-external

00:04:59

failed #675903
legacy
old-chrome-browser-functional-external-chrome

00:04:56

failed #675861
legacy
old-chrome-browser-functional-external-chrome

00:04:56

 
Name Stage Failure
failed
stop_deploy_review_server Deploy Review There has been a missing dependency failure
No job log
failed
old-chrome-browser-functional-external-chrome Test External

Makefile:15: recipe for target 'external' failed
make: *** [external] Error 1
make: Leaving directory '/home/gitlab-runner/builds/U7Q_BXuw/0/vidjil/vidjil/browser/test'
Uploading artifacts...
Runtime platform arch=amd64 os=linux pid=12941 revision=4745a6f3 version=11.8.0
browser/test/test/TEST-*.xml: found 4 matching files

Uploading artifacts to coordinator... ok
id=675909 responseStatus=201 Created token=j5-u-4ss
ERROR: Job failed: exit status 1
failed
ff32-browser-functional-external Test External

Makefile:15: recipe for target 'external' failed
make: *** [external] Error 1
make: Leaving directory '/home/gitlab-runner/builds/ziJxcFPn/0/vidjil/vidjil/browser/test'
Uploading artifacts...
Runtime platform arch=amd64 os=linux pid=31200 revision=58272c27 version=12.7.0
browser/test/test/TEST-*.xml: found 4 matching files

Uploading artifacts to coordinator... ok
id=675928 responseStatus=201 Created token=mSsKo21B
ERROR: Job failed: exit status 1
failed
ff45-browser-functional-external Test External

Makefile:15: recipe for target 'external' failed
make: *** [external] Error 1
make: Leaving directory '/home/gitlab-runner/builds/b8d876c1/0/vidjil/vidjil/browser/test'
Uploading artifacts...
Runtime platform arch=386 os=linux pid=14066 revision=58272c27 version=12.7.0
browser/test/test/TEST-*.xml: found 4 matching files

Uploading artifacts to coordinator... ok
id=675933 responseStatus=201 Created token=3kANsc2t
ERROR: Job failed: exit status 1
failed
chrome-browser-functional-external Test External

Makefile:15: recipe for target 'external' failed
make: *** [external] Error 1
make: Leaving directory '/home/gitlab-runner/builds/ziJxcFPn/0/vidjil/vidjil/browser/test'
Uploading artifacts...
Runtime platform arch=amd64 os=linux pid=836 revision=58272c27 version=12.7.0
browser/test/test/TEST-*.xml: found 4 matching files

Uploading artifacts to coordinator... ok
id=675934 responseStatus=201 Created token=qzWmn863
ERROR: Job failed: exit status 1