Revert "testFiles/segmenter_test.js: no test requiring outside cgi"

This reverts commit 7b4bdd27.
29 jobs for hotfix-cs/partial-revert in 32 minutes and 30 seconds (queued for 2 seconds)
Status Name Job ID Coverage
  Test Tools
passed test_tools #675596

00:00:09

failed test_tools #675575

00:00:01

 
  Test Quality
passed code_quality #675576
web

00:00:11

 
  Test Unit
passed test_browser_unit #675639
web

00:00:22

passed test_server_unit #675578
web

00:00:16

failed test_browser_unit #675577
web

00:00:22

 
  Deploy Review
passed deploy_review #675579
web

00:00:07

passed deploy_review_server #675580

00:01:31

passed stop_deploy_review #675581
web manual

00:00:03

passed stop_deploy_review_server #675582
manual

00:00:46

 
  Test Functional
passed chrome-browser-functional #675585
web

00:03:44

passed ff32-browser-functional #675583
web

00:03:45

passed ff32-server-functional #675587
x86_64 docker

00:08:07

passed ff45-browser-functional #675584
web

00:04:13

passed ff45-server-functional #675652
docker x86_64

00:07:01

passed old-chrome-browser-functional #675586
legacy

00:03:43

failed ff45-server-functional #675588
x86_64 docker

00:02:52

 
  Test Functional External
failed chrome-browser-functional-external #675691
web

00:04:23

failed ff32-browser-functional-external #675682
web

00:04:28

failed ff45-browser-functional-external #675692
web

00:04:46

failed old-chrome-browser-functional-external-chrome #675683
legacy

00:04:38

failed chrome-browser-functional-external #675681
web

00:04:18

failed chrome-browser-functional-external #675591
web

00:04:22

failed ff32-browser-functional-external #675673
web

00:04:26

failed ff32-browser-functional-external #675589
web

00:04:36

failed ff45-browser-functional-external #675674
web

00:04:43

failed ff45-browser-functional-external #675590
web

00:04:40

failed old-chrome-browser-functional-external-chrome #675672
legacy

00:04:37

failed old-chrome-browser-functional-external-chrome #675592
legacy

00:04:36

 
Name Stage Failure
failed
ff45-browser-functional-external Test Functional External

Makefile:14: recipe for target 'external' failed
make: *** [external] Error 1
make: Leaving directory '/home/gitlab-runner/builds/b8d876c1/0/vidjil/vidjil/browser/test'
Uploading artifacts...
Runtime platform arch=386 os=linux pid=11222 revision=58272c27 version=12.7.0
browser/test/test/TEST-*.xml: found 4 matching files

Uploading artifacts to coordinator... ok
id=675692 responseStatus=201 Created token=ZonrVTHo
ERROR: Job failed: exit status 1
failed
chrome-browser-functional-external Test Functional External

Makefile:14: recipe for target 'external' failed
make: *** [external] Error 1
make: Leaving directory '/home/gitlab-runner/builds/b8d876c1/0/vidjil/vidjil/browser/test'
Uploading artifacts...
Runtime platform arch=386 os=linux pid=10028 revision=58272c27 version=12.7.0
browser/test/test/TEST-*.xml: found 4 matching files

Uploading artifacts to coordinator... ok
id=675691 responseStatus=201 Created token=zcnae5tV
ERROR: Job failed: exit status 1
failed
ff32-browser-functional-external Test Functional External

Makefile:14: recipe for target 'external' failed
make: *** [external] Error 1
make: Leaving directory '/home/gitlab-runner/builds/ziJxcFPn/0/vidjil/vidjil/browser/test'
Uploading artifacts...
Runtime platform arch=amd64 os=linux pid=26442 revision=58272c27 version=12.7.0
browser/test/test/TEST-*.xml: found 4 matching files

Uploading artifacts to coordinator... ok
id=675682 responseStatus=201 Created token=z2h_nyUq
ERROR: Job failed: exit status 1
failed
old-chrome-browser-functional-external-chrome Test Functional External

Makefile:14: recipe for target 'external' failed
make: *** [external] Error 1
make: Leaving directory '/home/gitlab-runner/builds/U7Q_BXuw/0/vidjil/vidjil/browser/test'
Uploading artifacts...
Runtime platform arch=amd64 os=linux pid=25683 revision=4745a6f3 version=11.8.0
browser/test/test/TEST-*.xml: found 4 matching files

Uploading artifacts to coordinator... ok
id=675683 responseStatus=201 Created token=XHwfXNsg
ERROR: Job failed: exit status 1