test_scatterplot.js

why do i need to edit scatterplot_test.js for something related to url... 
22 jobs for feature-c/url_params in 23 minutes and 11 seconds (queued for 3 seconds)
latest
Status Name Job ID Coverage
  Test Tools
passed test_tools #671562

00:00:22

 
  Test Quality
passed code_quality #671563
web

00:00:11

 
  Test Unit
passed test_browser_unit #671564
web

00:00:44

 
  Deploy Review
manual deploy_review #671565
web allowed to fail manual
manual stop_deploy_review #671566
web allowed to fail manual
 
  Test Functional
passed chrome-browser-functional #671569
web

00:04:58

passed ff32-browser-functional #671567
web

00:04:40

passed ff45-browser-functional #671568
web

00:05:49

passed old-chrome-browser-functional #671570
legacy

00:04:50

 
  Test Functional External
passed chrome-browser-functional-external #685564
web

00:01:52

failed ff32-browser-functional-external #671600
web

00:04:59

failed ff45-browser-functional-external #671602
web

00:05:10

failed old-chrome-browser-functional-external-chrome #671599
legacy

00:07:55

failed chrome-browser-functional-external #671603
web

00:04:45

failed chrome-browser-functional-external #671598
web

00:04:48

failed chrome-browser-functional-external #671573
web

00:04:46

failed ff32-browser-functional-external #671590
web

00:05:07

failed ff32-browser-functional-external #671571
web

00:05:16

failed ff45-browser-functional-external #671591
web

00:05:11

failed ff45-browser-functional-external #671572
web

00:05:18

failed old-chrome-browser-functional-external-chrome #671589
legacy

00:05:01

failed old-chrome-browser-functional-external-chrome #671574
legacy

00:05:11

 
Name Stage Failure
failed
ff32-browser-functional-external Test Functional External

Makefile:14: recipe for target 'external' failed
make: *** [external] Error 1
make: Leaving directory '/home/gitlab-runner/builds/ziJxcFPn/0/vidjil/vidjil/browser/test'
Uploading artifacts...
Runtime platform arch=amd64 os=linux pid=23152 revision=58272c27 version=12.7.0
browser/test/test/TEST-*.xml: found 4 matching files

Uploading artifacts to coordinator... ok
id=671600 responseStatus=201 Created token=wzD7zG_1
ERROR: Job failed: exit status 1
failed
old-chrome-browser-functional-external-chrome Test Functional External

Makefile:14: recipe for target 'external' failed
make: *** [external] Error 1
make: Leaving directory '/home/gitlab-runner/builds/U7Q_BXuw/0/vidjil/vidjil/browser/test'
Uploading artifacts...
Runtime platform arch=amd64 os=linux pid=1323 revision=4745a6f3 version=11.8.0
browser/test/test/TEST-*.xml: found 4 matching files

Uploading artifacts to coordinator... ok
id=671599 responseStatus=201 Created token=T3X6AHkL
ERROR: Job failed: exit status 1
failed
ff45-browser-functional-external Test Functional External

Makefile:14: recipe for target 'external' failed
make: *** [external] Error 1
make: Leaving directory '/home/gitlab-runner/builds/b8d876c1/0/vidjil/vidjil/browser/test'
Uploading artifacts...
Runtime platform arch=386 os=linux pid=3976 revision=58272c27 version=12.7.0
browser/test/test/TEST-*.xml: found 4 matching files

Uploading artifacts to coordinator... ok
id=671602 responseStatus=201 Created token=iTVBEsFt
ERROR: Job failed: exit status 1