test_scatterplot.js

why do i need to edit scatterplot_test.js for something related to url... 
22 jobs for feature-c/url_params in 23 minutes and 11 seconds (queued for 3 seconds)
latest
Status Job ID Name Coverage
  Test Tools
passed #671562
test_tools

00:00:22

 
  Test Quality
passed #671563
web
code_quality

00:00:11

 
  Test Unit
passed #671564
web
test_browser_unit

00:00:44

 
  Deploy Review
manual #671565
web allowed to fail manual
deploy_review
manual #671566
web allowed to fail manual
stop_deploy_review
 
  Test Functional
passed #671569
web
chrome-browser-functional

00:04:58

passed #671567
web
ff32-browser-functional

00:04:40

passed #671568
web
ff45-browser-functional

00:05:49

passed #671570
legacy
old-chrome-browser-functional

00:04:50

 
  Test Functional External
passed #685564
web
chrome-browser-functional-external

00:01:52

failed #671600
web
ff32-browser-functional-external

00:04:59

failed #671602
web
ff45-browser-functional-external

00:05:10

failed #671599
legacy
old-chrome-browser-functional-external-chrome

00:07:55

failed #671603
web
chrome-browser-functional-external

00:04:45

failed #671598
web
chrome-browser-functional-external

00:04:48

failed #671573
web
chrome-browser-functional-external

00:04:46

failed #671590
web
ff32-browser-functional-external

00:05:07

failed #671571
web
ff32-browser-functional-external

00:05:16

failed #671591
web
ff45-browser-functional-external

00:05:11

failed #671572
web
ff45-browser-functional-external

00:05:18

failed #671574
legacy
old-chrome-browser-functional-external-chrome

00:05:11

failed #671589
legacy
old-chrome-browser-functional-external-chrome

00:05:01

 
Name Stage Failure
failed
ff45-browser-functional-external Test Functional External

Makefile:14: recipe for target 'external' failed
make: *** [external] Error 1
make: Leaving directory '/home/gitlab-runner/builds/b8d876c1/0/vidjil/vidjil/browser/test'
Uploading artifacts...
Runtime platform arch=386 os=linux pid=3976 revision=58272c27 version=12.7.0
browser/test/test/TEST-*.xml: found 4 matching files

Uploading artifacts to coordinator... ok
id=671602 responseStatus=201 Created token=iTVBEsFt
ERROR: Job failed: exit status 1
failed
ff32-browser-functional-external Test Functional External

Makefile:14: recipe for target 'external' failed
make: *** [external] Error 1
make: Leaving directory '/home/gitlab-runner/builds/ziJxcFPn/0/vidjil/vidjil/browser/test'
Uploading artifacts...
Runtime platform arch=amd64 os=linux pid=23152 revision=58272c27 version=12.7.0
browser/test/test/TEST-*.xml: found 4 matching files

Uploading artifacts to coordinator... ok
id=671600 responseStatus=201 Created token=wzD7zG_1
ERROR: Job failed: exit status 1
failed
old-chrome-browser-functional-external-chrome Test Functional External

Makefile:14: recipe for target 'external' failed
make: *** [external] Error 1
make: Leaving directory '/home/gitlab-runner/builds/U7Q_BXuw/0/vidjil/vidjil/browser/test'
Uploading artifacts...
Runtime platform arch=amd64 os=linux pid=1323 revision=4745a6f3 version=11.8.0
browser/test/test/TEST-*.xml: found 4 matching files

Uploading artifacts to coordinator... ok
id=671599 responseStatus=201 Created token=T3X6AHkL
ERROR: Job failed: exit status 1