algo/tests/testRepresentative: More reproducible test

Reset the seed to have the same conditions. Otherwise depending on the number of tests and the number of times
the pseudo-random generator has been used the test may fail or succeed (we are using a RandomScore now)
19 jobs for feature-a/one-heuristic in 2 minutes and 14 seconds (queued for 3 seconds)
latest
Status Job ID Name Coverage
  Test Tools
passed #632177
test_tools

00:00:10

 
  Test Unit
failed #632178
test_algo_unit

00:02:04

 
  Test Functional
skipped #632179
test_algo_should
 
  Test Shouldvdj
skipped #632180
test_algo_shouldvdj
 
  Coverage
skipped #632181
algo_coverage
 
  Prepare Release
skipped #632182
allowed to fail manual
prepare_release
 
  Valgrind Unit
skipped #632183
valgrind
algo_valgrind_unit
 
  Valgrind Functional
skipped #632184
valgrind allowed to fail manual
algo_valgrind_functional
 
  Multiple Tests
skipped #632191
cidocker allowed to fail manual
test_clang34_manual
skipped #632192
cidocker allowed to fail manual
test_clang4_manual
skipped #632193
cidocker allowed to fail manual
test_clang6_manual
skipped #632194
cidocker allowed to fail manual
test_clang7_manual
skipped #632185
cidocker allowed to fail manual
test_gcc48_manual
skipped #632186
cidocker allowed to fail manual
test_gcc5_manual
skipped #632187
cidocker allowed to fail manual
test_gcc6_manual
skipped #632188
cidocker allowed to fail manual
test_gcc7_manual
skipped #632189
cidocker allowed to fail manual
test_gcc8_manual
skipped #632190
cidocker allowed to fail manual
test_gcc9_manual
 
  Benchmark
skipped #632195
several-compilers allowed to fail manual
benchmark_algo
 
Name Stage Failure
failed
test_algo_unit Test Unit
make[2]: *** [unit-tests/tests.o] Error 1
make[2]: Leaving directory '/home/gitlab-runner/builds/b8d876c1/0/vidjil/vidjil/algo/tests'
Makefile:174: recipe for target 'unit' failed
make[1]: *** [unit] Error 2
make[1]: Leaving directory '/home/gitlab-runner/builds/b8d876c1/0/vidjil/vidjil/algo'
Makefile:209: recipe for target 'unit_coverage' failed
make: *** [unit_coverage] Error 2
make: Leaving directory '/home/gitlab-runner/builds/b8d876c1/0/vidjil/vidjil/algo'
ERROR: Job failed: exit status 1