Update view sample_set.html; fix launch button filter

Link to #3827
Status Job ID Name Coverage
  Test Tools
passed #619306
test_tools

00:00:09

 
  Test Quality
passed #619307
web
code_quality

00:00:09

 
  Test Unit
passed #1123542
web
test_browser_unit

00:01:02

failed #1123543
web
test_server_unit

00:00:12

passed #619308
web
test_browser_unit

00:00:49

passed #619309
web
test_server_unit

00:00:19

 
  Deploy Review
passed #619310
web
deploy_review

00:00:17

failed #1123544
allowed to fail manual
deploy_review_server

00:00:05

manual #619312
web allowed to fail manual
stop_deploy_review
manual #619313
allowed to fail manual
stop_deploy_review_server
failed #1123541
allowed to fail manual
deploy_review_server

failed #1123486
allowed to fail manual
deploy_review_server

failed #1123481
allowed to fail manual
deploy_review_server

failed #619311
allowed to fail manual
deploy_review_server

 
  Test Functional
passed #619316
web
chrome-browser-functional

00:04:22

passed #619314
web
ff32-browser-functional

00:04:10

passed #625162
x86_64 docker
ff32-server-functional

00:06:27

passed #619315
web
ff45-browser-functional

00:04:51

passed #625160
x86_64 docker
ff45-server-functional

00:06:39

passed #619317
legacy
old-chrome-browser-functional

00:04:05

passed #625161
x86_64 docker
ff32-server-functional

00:06:39

failed #619318
docker x86_64
ff32-server-functional

00:02:53

failed #619319
docker x86_64
ff45-server-functional

00:02:41

 
  Test Functional External
passed #619322
web
chrome-browser-functional-external

00:01:18

passed #619320
web
ff32-browser-functional-external

00:01:30

passed #619321
web
ff45-browser-functional-external

00:01:40

passed #619323
legacy
old-chrome-browser-functional-external-chrome

00:01:28

 
Name Stage Failure
failed
test_server_unit Test Unit

Makefile:7: recipe for target 'download_web2py' failed
make: *** [download_web2py] Error 8
make: Leaving directory '/home/gitlab-runner/builds/ziJxcFPn/0/vidjil/vidjil/server'
Uploading artifacts...
Runtime platform arch=amd64 os=linux pid=2313 revision=58272c27 version=12.7.0
WARNING: server/web2py/test-reports/TEST*xml: no matching files
ERROR: No files to upload
ERROR: Job failed: exit status 1
failed
deploy_review_server Deploy Review
make[2]: *** [fontsave] Error 3
make[2]: Leaving directory '/home/gitlab-runner/builds/b8d876c1/0/vidjil/vidjil/browser/css/icons'
Makefile:6: recipe for target 'retrieve' failed
make[1]: *** [retrieve] Error 2
make[1]: Leaving directory '/home/gitlab-runner/builds/b8d876c1/0/vidjil/vidjil/browser/css/icons'
Makefile:10: recipe for target 'icons' failed
make: *** [icons] Error 2
make: Leaving directory '/home/gitlab-runner/builds/b8d876c1/0/vidjil/vidjil/browser'
ERROR: Job failed: exit status 1