kmerstore: Add isAmbiguous function for compatibility reasons

19 jobs for feature-a/4225-missing-affectations in 24 minutes and 41 seconds (queued for 3 seconds)
Status Job ID Name Coverage
  Test Tools
passed #589482
test_tools

00:00:09

 
  Test Unit
passed #589483
test_algo_unit

00:03:22

 
  Test Functional
passed #589484
test_algo_should

00:09:05

 
  Test Shouldvdj
failed #589485
test_algo_shouldvdj

00:12:04

 
  Coverage
skipped #589486
algo_coverage
 
  Prepare Release
skipped #589487
allowed to fail manual
prepare_release
 
  Valgrind Unit
skipped #589488
valgrind
algo_valgrind_unit
 
  Valgrind Functional
skipped #589489
valgrind allowed to fail manual
algo_valgrind_functional
 
  Multiple Tests
skipped #589496
cidocker allowed to fail manual
test_clang34_manual
skipped #589497
cidocker allowed to fail manual
test_clang4_manual
skipped #589498
cidocker allowed to fail manual
test_clang6_manual
skipped #589499
cidocker allowed to fail manual
test_clang7_manual
skipped #589490
cidocker allowed to fail manual
test_gcc48_manual
skipped #589491
cidocker allowed to fail manual
test_gcc5_manual
skipped #589492
cidocker allowed to fail manual
test_gcc6_manual
skipped #589493
cidocker allowed to fail manual
test_gcc7_manual
skipped #589494
cidocker allowed to fail manual
test_gcc8_manual
skipped #589495
cidocker allowed to fail manual
test_gcc9_manual
 
  Benchmark
skipped #589500
several-compilers allowed to fail manual
benchmark_algo
 
Name Stage Failure
failed
test_algo_shouldvdj Test Shouldvdj
make[2]: *** [shouldvdj_if_python] Error 2
make[2]: Leaving directory '/home/gitlab-runner/builds/b8d876c1/0/vidjil/vidjil/algo/tests'
Makefile:191: recipe for target 'shouldvdj' failed
make[1]: *** [shouldvdj] Error 2
make[1]: Leaving directory '/home/gitlab-runner/builds/b8d876c1/0/vidjil/vidjil/algo'
Makefile:215: recipe for target 'shouldvdj_coverage' failed
make: *** [shouldvdj_coverage] Error 2
make: Leaving directory '/home/gitlab-runner/builds/b8d876c1/0/vidjil/vidjil/algo'
ERROR: Job failed: exit status 1