Merge branch 'dev' of gitlab.inria.fr:vidjil/vidjil into feature-c/4020_minor_fix_distribution

Status Job ID Name Coverage
  Test Tools
passed #576515
test_tools

00:00:08

 
  Test Quality
passed #576516
web
code_quality

00:00:10

 
  Test Unit
passed #576517
web
test_browser_unit

00:00:44

 
  Deploy Review
passed #576518
web
deploy_review

00:00:21

manual #576520
web allowed to fail manual
stop_deploy_review
 
  Test Functional
failed #576548
web
chrome-browser-functional

00:04:04

failed #576547
web
ff32-browser-functional

00:02:22

failed #576559
web
ff45-browser-functional

00:03:26

failed #576546
legacy
old-chrome-browser-functional

00:02:36

failed #576544
web
chrome-browser-functional

00:03:26

failed #576523
web
chrome-browser-functional

00:02:43

failed #576536
web
ff32-browser-functional

00:02:32

failed #576521
web
ff32-browser-functional

00:02:07

failed #576522
web
ff45-browser-functional

00:03:24

failed #576545
web
ff45-browser-functional

00:03:26

failed #576524
legacy
old-chrome-browser-functional

00:02:32

failed #576538
legacy
old-chrome-browser-functional

00:02:34

 
  Test Functional External
skipped #576527
web
chrome-browser-functional-external
skipped #576525
web
ff32-browser-functional-external
skipped #576526
web
ff45-browser-functional-external
skipped #576528
legacy
old-chrome-browser-functional-external-chrome
 
Name Stage Failure
failed
chrome-browser-functional Test Functional

Makefile:11: recipe for target 'functional' failed
make: *** [functional] Error 1
make: Leaving directory '/home/gitlab-runner/builds/9103f1f5/0/vidjil/vidjil/browser/test'
Uploading artifacts...
Runtime platform arch=amd64 os=linux pid=15100 revision=58272c27 version=12.7.0
browser/test/test/TEST-*.xml: found 10 matching files

Uploading artifacts to coordinator... ok
id=576548 responseStatus=201 Created token=1ayrgj-x
ERROR: Job failed: exit status 1
failed
ff45-browser-functional Test Functional

Makefile:11: recipe for target 'functional' failed
make: *** [functional] Error 1
make: Leaving directory '/home/gitlab-runner/builds/b8d876c1/0/vidjil/vidjil/browser/test'
Uploading artifacts...
Runtime platform arch=386 os=linux pid=32238 revision=58272c27 version=12.7.0
browser/test/test/TEST-*.xml: found 10 matching files

Uploading artifacts to coordinator... ok
id=576559 responseStatus=201 Created token=4jodrm_Y
ERROR: Job failed: exit status 1
failed
ff32-browser-functional Test Functional

Makefile:11: recipe for target 'functional' failed
make: *** [functional] Error 1
make: Leaving directory '/home/gitlab-runner/builds/b8d876c1/0/vidjil/vidjil/browser/test'
Uploading artifacts...
Runtime platform arch=386 os=linux pid=30408 revision=58272c27 version=12.7.0
browser/test/test/TEST-*.xml: found 10 matching files

Uploading artifacts to coordinator... ok
id=576547 responseStatus=201 Created token=xKxtxYkN
ERROR: Job failed: exit status 1
failed
old-chrome-browser-functional Test Functional

Makefile:11: recipe for target 'functional' failed
make: *** [functional] Error 1
make: Leaving directory '/home/gitlab-runner/builds/U7Q_BXuw/0/vidjil/vidjil/browser/test'
Uploading artifacts...
Runtime platform arch=amd64 os=linux pid=14916 revision=4745a6f3 version=11.8.0
browser/test/test/TEST-*.xml: found 10 matching files

Uploading artifacts to coordinator... ok
id=576546 responseStatus=201 Created token=MyZumhQi
ERROR: Job failed: exit status 1