segmenter.js : excessive reset

22 jobs for hotfix-c/segmenter_and_unconventional_clones in 13 minutes and 45 seconds (queued for 2 seconds)
Name Stage Failure
failed
ff32-browser-functional Test Functional
=== functional/test_segmenter_page_errors.rb : ok 

Makefile:11: recipe for target 'functional' failed
make: *** [functional] Error 1
make: Leaving directory '/home/gitlab-runner/builds/b8d876c1/0/vidjil/vidjil/browser/test'
Uploading artifacts...
browser/test/test/TEST-*.xml: found 10 matching files
Uploading artifacts to coordinator... ok
id=514880 responseStatus=201 Created token=7uc7vd6r
ERROR: Job failed: exit status 1
failed
chrome-browser-functional Test Functional

Makefile:11: recipe for target 'functional' failed
make: *** [functional] Error 1
make: Leaving directory '/home/gitlab-runner/builds/ziJxcFPn/0/vidjil/vidjil/browser/test'
Uploading artifacts...
Runtime platform arch=amd64 os=linux pid=7006 revision=692ae235 version=11.9.0
browser/test/test/TEST-*.xml: found 10 matching files

Uploading artifacts to coordinator... ok
id=514881 responseStatus=201 Created token=6Un6zqHj
ERROR: Job failed: exit status 1
failed
ff45-browser-functional Test Functional
=== functional/test_segmenter_page_errors.rb : ok 

Makefile:11: recipe for target 'functional' failed
make: *** [functional] Error 1
make: Leaving directory '/home/gitlab-runner/builds/9103f1f5/0/vidjil/vidjil/browser/test'
Uploading artifacts...
browser/test/test/TEST-*.xml: found 10 matching files
Uploading artifacts to coordinator... ok
id=514886 responseStatus=201 Created token=3oK8yyJ_
ERROR: Job failed: exit status 1
failed
old-chrome-browser-functional Test Functional

Makefile:11: recipe for target 'functional' failed
make: *** [functional] Error 1
make: Leaving directory '/home/gitlab-runner/builds/U7Q_BXuw/0/vidjil/vidjil/browser/test'
Uploading artifacts...
Runtime platform arch=amd64 os=linux pid=12763 revision=4745a6f3 version=11.8.0
browser/test/test/TEST-*.xml: found 10 matching files

Uploading artifacts to coordinator... ok
id=514887 responseStatus=201 Created token=Vv4zFwji
ERROR: Job failed: exit status 1