fitness_avg,fitness_std,fitness_min,fitness_max,fitness_gen,fitness_nevals,size_avg,size_std,size_min,size_max,size_gen,size_nevals,complexity_avg,complexity_std,complexity_min,complexity_max,complexity_gen,complexity_nevals,gen,nevals
15.183333333333332,26.59621422516955,8.0,193.33333333333334,0.0,100.0,1.0,0.0,1.0,1.0,0.0,100.0,19.37,16.519476383953577,6.0,79.0,0.0,100.0,0,100
20.519665404040406,37.22650884632466,8.0,204.5625,1.0,100.0,1.0,0.0,1.0,1.0,1.0,100.0,11.47,12.8128490196365,1.0,79.0,1.0,100.0,1,100
23.81238872238872,41.8229987843982,9.0,209.30769230769232,2.0,100.0,1.0,0.0,1.0,1.0,2.0,100.0,8.36,6.818386906006434,1.0,41.0,2.0,100.0,2,100
30.974440675811643,52.633071860464675,8.0,214.80555555555554,3.0,100.0,1.0,0.0,1.0,1.0,3.0,100.0,7.0,6.732013071882734,1.0,41.0,3.0,100.0,3,100
40.3540464257575,63.85283613524745,8.0,227.8181818181818,4.0,100.0,1.0,0.0,1.0,1.0,4.0,100.0,6.06,6.881598651476269,1.0,33.0,4.0,100.0,4,100
57.29402660046259,74.44843067406931,8.0,217.0,5.0,100.0,1.0,0.0,1.0,1.0,5.0,100.0,5.84,8.783757738007123,1.0,41.0,5.0,100.0,5,100
37.44328623343385,74.82978966435171,9.0,471.72727272727275,6.0,100.0,1.0,0.0,1.0,1.0,6.0,100.0,3.34,7.74495965128289,1.0,52.0,6.0,100.0,6,100
38.643260587722075,84.30094212278424,9.0,500.0,7.0,100.0,1.0,0.0,1.0,1.0,7.0,100.0,2.51,4.539812771469766,1.0,26.0,7.0,100.0,7,100
31.193182179616716,77.57339541295902,10.0,478.6666666666667,8.0,100.0,1.0,0.0,1.0,1.0,8.0,100.0,1.96,3.4840206658399717,1.0,21.0,8.0,100.0,8,100
29.12053507992139,76.07724290135602,10.0,485.5483870967742,9.0,100.0,1.0,0.0,1.0,1.0,9.0,100.0,1.82,3.229179462340239,1.0,21.0,9.0,100.0,9,100
29.113877339910285,77.25623821807936,10.0,500.0,10.0,100.0,1.0,0.0,1.0,1.0,10.0,100.0,1.82,3.229179462340239,1.0,21.0,10.0,100.0,10,100
39.0155460541988,101.75822073250023,10.0,500.0,11.0,100.0,1.0,0.0,1.0,1.0,11.0,100.0,2.22,4.196617685708338,1.0,21.0,11.0,100.0,11,100
48.982800339436906,120.55789974526617,10.0,500.0,12.0,100.0,1.0,0.0,1.0,1.0,12.0,100.0,2.64,5.024977611890426,1.0,23.0,12.0,100.0,12,100
51.13684756318949,125.25243357504144,10.0,500.0,13.0,100.0,1.0,0.0,1.0,1.0,13.0,100.0,2.75,5.305421755148219,1.0,23.0,13.0,100.0,13,100
61.22639646152431,140.56336364806052,10.0,500.0,14.0,100.0,1.0,0.0,1.0,1.0,14.0,100.0,3.15,5.881113840081656,1.0,23.0,14.0,100.0,14,100
76.1871256684492,158.4459500961276,10.0,500.0,15.0,100.0,1.0,0.0,1.0,1.0,15.0,100.0,3.73,6.557217397646658,1.0,23.0,15.0,100.0,15,100
41.70545454545454,110.71820019556611,10.0,500.0,16.0,100.0,1.0,0.0,1.0,1.0,16.0,100.0,2.18,4.219905212205601,1.0,21.0,16.0,100.0,16,100
42.2682302346776,109.20695927916039,10.0,500.0,17.0,100.0,1.0,0.0,1.0,1.0,17.0,100.0,2.3,4.3531597719357835,1.0,21.0,17.0,100.0,17,100
34.76694223339384,91.0425321111569,10.0,500.0,18.0,100.0,1.0,0.0,1.0,1.0,18.0,100.0,2.02,3.5888159607313384,1.0,19.0,18.0,100.0,18,100
41.75481341173906,103.52050858185444,10.0,500.0,19.0,100.0,1.0,0.0,1.0,1.0,19.0,100.0,2.32,4.086269692519083,1.0,19.0,19.0,100.0,19,100
44.849071681420845,112.17509924728908,10.0,500.0,20.0,100.0,1.0,0.0,1.0,1.0,20.0,100.0,2.34,4.152637715958376,1.0,19.0,20.0,100.0,20,100
61.909584842734745,136.7474985047969,10.0,500.0,21.0,100.0,1.0,0.0,1.0,1.0,21.0,100.0,2.96,4.983813800695207,1.0,19.0,21.0,100.0,21,100
60.81077503142019,136.86119115138828,10.0,500.0,22.0,100.0,1.0,0.0,1.0,1.0,22.0,100.0,2.84,4.884096641140509,1.0,19.0,22.0,100.0,22,100
66.13854489596424,144.23272961005802,10.0,500.0,23.0,100.0,1.0,0.0,1.0,1.0,23.0,100.0,3.0,5.079370039680118,1.0,19.0,23.0,100.0,23,100
75.97552760378882,155.88386780448133,10.0,500.0,24.0,100.0,1.0,0.0,1.0,1.0,24.0,100.0,3.32,5.434850503923728,1.0,19.0,24.0,100.0,24,100
102.83789694176791,180.7668192114527,10.0,500.0,25.0,100.0,1.0,0.0,1.0,1.0,25.0,100.0,4.21,6.182709761908606,1.0,19.0,25.0,100.0,25,100
117.55789694176791,192.1713736274484,10.0,500.0,26.0,100.0,1.0,0.0,1.0,1.0,26.0,100.0,4.69,6.526400232900217,1.0,19.0,26.0,100.0,26,100
152.71545454545455,212.94624681208725,10.0,500.0,27.0,100.0,1.0,0.0,1.0,1.0,27.0,100.0,5.81,7.141001330345765,1.0,19.0,27.0,100.0,27,100
194.41545454545457,226.93581718685016,10.0,500.0,28.0,100.0,1.0,0.0,1.0,1.0,28.0,100.0,7.2,7.57495874576225,1.0,19.0,28.0,100.0,28,100
88.90545454545455,168.1437302915682,10.0,500.0,29.0,100.0,1.0,0.0,1.0,1.0,29.0,100.0,3.64,5.583045763738642,1.0,17.0,29.0,100.0,29,100
36.98,96.98432656878119,10.0,500.0,30.0,100.0,1.0,0.0,1.0,1.0,30.0,100.0,1.86,3.17811264746862,1.0,17.0,30.0,100.0,30,100
40.07681818181818,102.86293610314813,10.0,500.0,31.0,100.0,1.0,0.0,1.0,1.0,31.0,100.0,2.09,3.5639725026997615,1.0,17.0,31.0,100.0,31,100
47.60067099567099,113.44508027206588,10.0,500.0,32.0,100.0,1.0,0.0,1.0,1.0,32.0,100.0,2.63,5.096381068954715,1.0,36.0,32.0,100.0,32,100
62.49206744868035,137.1432732098304,10.0,500.0,33.0,100.0,1.0,0.0,1.0,1.0,33.0,100.0,2.94,4.851432778056397,1.0,19.0,33.0,100.0,33,100
65.17206674534488,142.91149992727807,10.0,500.0,34.0,100.0,1.0,0.0,1.0,1.0,34.0,100.0,2.94,4.851432778056397,1.0,19.0,34.0,100.0,34,100
89.68102642276422,170.63126939729025,10.0,500.0,35.0,100.0,1.0,0.0,1.0,1.0,35.0,100.0,3.74,5.708975389682461,1.0,19.0,35.0,100.0,35,100
118.39764979938762,191.00969655521547,10.0,500.0,36.0,100.0,1.0,0.0,1.0,1.0,36.0,100.0,4.82,6.573248816224745,1.0,24.0,36.0,100.0,36,100
143.0576497993876,206.31426632690648,10.0,500.0,37.0,100.0,1.0,0.0,1.0,1.0,37.0,100.0,5.58,6.958706776406086,1.0,24.0,37.0,100.0,37,100
193.2209642857143,225.84944970149374,10.0,500.0,38.0,100.0,1.0,0.0,1.0,1.0,38.0,100.0,7.07,7.369199413776235,1.0,19.0,38.0,100.0,38,100
257.26763095238096,234.2510546180612,10.0,500.0,39.0,100.0,1.0,0.0,1.0,1.0,39.0,100.0,9.11,7.574820129877673,1.0,19.0,39.0,100.0,39,100
196.10763095238093,225.7135521136671,10.0,500.0,40.0,100.0,1.0,0.0,1.0,1.0,40.0,100.0,7.05,7.189401922274201,1.0,17.0,40.0,100.0,40,100
108.21763095238094,181.2654541730957,10.0,500.0,41.0,100.0,1.0,0.0,1.0,1.0,41.0,100.0,4.11,5.544177125597631,1.0,17.0,41.0,100.0,41,100
140.77525,207.17786559786617,10.0,500.0,42.0,100.0,1.0,0.0,1.0,1.0,42.0,100.0,4.81,5.962709115829817,1.0,17.0,42.0,100.0,42,100
170.17525,220.85000179689268,10.0,500.0,43.0,100.0,1.0,0.0,1.0,1.0,43.0,100.0,5.65,6.340938416354476,1.0,17.0,43.0,100.0,43,100
217.285,234.79244296825226,10.0,500.0,44.0,100.0,1.0,0.0,1.0,1.0,44.0,100.0,6.92,6.685327217122586,1.0,17.0,44.0,100.0,44,100
253.275,240.24580511426208,10.5,500.0,45.0,100.0,1.0,0.0,1.0,1.0,45.0,100.0,7.82,6.738516157137266,1.0,15.0,45.0,100.0,45,100
253.275,240.24580511426208,10.5,500.0,46.0,100.0,1.0,0.0,1.0,1.0,46.0,100.0,7.8,6.720119046564578,1.0,15.0,46.0,100.0,46,100
253.275,240.24580511426208,10.5,500.0,47.0,100.0,1.0,0.0,1.0,1.0,47.0,100.0,7.76,6.682993341310462,1.0,15.0,47.0,100.0,47,100
243.495,239.95599070454568,10.5,500.0,48.0,100.0,1.0,0.0,1.0,1.0,48.0,100.0,7.42,6.607843823820295,1.0,15.0,48.0,100.0,48,100
236.375,238.25207632883286,10.5,500.0,49.0,100.0,1.0,0.0,1.0,1.0,49.0,100.0,7.08,6.383854634936482,1.0,15.0,49.0,100.0,49,100
231.485,237.80895120873814,10.5,500.0,50.0,100.0,1.0,0.0,1.0,1.0,50.0,100.0,6.82,6.2263633045301825,1.0,15.0,50.0,100.0,50,100
226.6,237.25968894862856,10.5,500.0,51.0,100.0,1.0,0.0,1.0,1.0,51.0,100.0,6.44,5.903083939772498,1.0,15.0,51.0,100.0,51,100
304.605,236.36716454490877,10.5,500.0,52.0,100.0,1.0,0.0,1.0,1.0,52.0,100.0,8.27,5.798025525987274,1.0,15.0,52.0,100.0,52,100
312.74,236.65804951448408,11.0,500.0,53.0,100.0,1.0,0.0,1.0,1.0,53.0,100.0,8.37,5.8114628106871695,1.0,13.0,53.0,100.0,53,100
302.96,238.8116379073683,11.0,500.0,54.0,100.0,1.0,0.0,1.0,1.0,54.0,100.0,8.13,5.8628576649958,1.0,13.0,54.0,100.0,54,100
298.07,239.7316105564721,11.0,500.0,55.0,100.0,1.0,0.0,1.0,1.0,55.0,100.0,8.01,5.884717495343341,1.0,13.0,55.0,100.0,55,100
298.07,239.7316105564721,11.0,500.0,56.0,100.0,1.0,0.0,1.0,1.0,56.0,100.0,8.01,5.884717495343341,1.0,13.0,56.0,100.0,56,100
298.07,239.7316105564721,11.0,500.0,57.0,100.0,1.0,0.0,1.0,1.0,57.0,100.0,8.01,5.884717495343341,1.0,13.0,57.0,100.0,57,100
273.62,242.80674537582354,11.0,500.0,58.0,100.0,1.0,0.0,1.0,1.0,58.0,100.0,7.41,5.956668531990008,1.0,13.0,58.0,100.0,58,100
268.73,243.12222666798695,11.0,500.0,59.0,100.0,1.0,0.0,1.0,1.0,59.0,100.0,7.29,5.963715284954506,1.0,13.0,59.0,100.0,59,100
258.95,243.4574860216872,11.0,500.0,60.0,100.0,1.0,0.0,1.0,1.0,60.0,100.0,7.05,5.970552738231195,1.0,13.0,60.0,100.0,60,100
254.06,243.47767125549726,11.0,500.0,61.0,100.0,1.0,0.0,1.0,1.0,61.0,100.0,6.93,5.970351748431578,1.0,13.0,61.0,100.0,61,100
254.06,243.47767125549726,11.0,500.0,62.0,100.0,1.0,0.0,1.0,1.0,62.0,100.0,6.93,5.970351748431578,1.0,13.0,62.0,100.0,62,100
249.17,243.39963249766836,11.0,500.0,63.0,100.0,1.0,0.0,1.0,1.0,63.0,100.0,6.81,5.967738265038104,1.0,13.0,63.0,100.0,63,100
239.39,242.94838525909162,11.0,500.0,64.0,100.0,1.0,0.0,1.0,1.0,64.0,100.0,6.57,5.955258180801232,1.0,13.0,64.0,100.0,64,100
234.5,242.57462769218054,11.0,500.0,65.0,100.0,1.0,0.0,1.0,1.0,65.0,100.0,6.45,5.945376354781924,1.0,13.0,65.0,100.0,65,100
149.3,217.96391903248573,10.0,500.0,66.0,100.0,1.0,0.0,1.0,1.0,66.0,100.0,4.39,5.28563146653264,1.0,13.0,66.0,100.0,66,100
33.59,94.46344213503973,10.0,500.0,67.0,100.0,1.0,0.0,1.0,1.0,67.0,100.0,1.58,2.241338885577101,1.0,13.0,67.0,100.0,67,100
35.71227272727273,97.87755106393256,10.0,500.0,68.0,100.0,1.0,0.0,1.0,1.0,68.0,100.0,1.83,2.884631692261596,1.0,18.0,68.0,100.0,68,100
45.29785714285714,117.2624525728079,10.0,500.0,69.0,100.0,1.0,0.0,1.0,1.0,69.0,100.0,2.07,3.277971933986013,1.0,18.0,69.0,100.0,69,100
51.609809384164215,125.98250410865477,10.0,500.0,70.0,100.0,1.0,0.0,1.0,1.0,70.0,100.0,2.3,3.5846896657869842,1.0,18.0,70.0,100.0,70,100
61.31415843139289,140.4831163683442,10.0,500.0,71.0,100.0,1.0,0.0,1.0,1.0,71.0,100.0,2.54,3.8792267270681666,1.0,18.0,71.0,100.0,71,100
71.1025660888011,153.0694341231839,10.0,500.0,72.0,100.0,1.0,0.0,1.0,1.0,72.0,100.0,2.73,4.04439117791541,1.0,18.0,72.0,100.0,72,100
91.25386738351256,174.59798380921504,10.0,500.0,73.0,100.0,1.0,0.0,1.0,1.0,73.0,100.0,3.1,4.4732538492690095,1.0,18.0,73.0,100.0,73,100
114.78322222222221,195.039538558781,10.0,500.0,74.0,100.0,1.0,0.0,1.0,1.0,74.0,100.0,3.57,4.846142796080197,1.0,18.0,74.0,100.0,74,100
158.65488888888888,219.75779746735657,10.0,500.0,75.0,100.0,1.0,0.0,1.0,1.0,75.0,100.0,4.57,5.378206020598318,1.0,18.0,75.0,100.0,75,100
173.095,226.577985415618,10.5,500.0,76.0,100.0,1.0,0.0,1.0,1.0,76.0,100.0,4.65,5.183386923624359,1.0,13.0,76.0,100.0,76,100
163.785,222.97835382610572,10.5,500.0,77.0,100.0,1.0,0.0,1.0,1.0,77.0,100.0,4.12,4.701659281572836,1.0,13.0,77.0,100.0,77,100
154.005,218.70014283260087,10.5,500.0,78.0,100.0,1.0,0.0,1.0,1.0,78.0,100.0,3.53,3.98862131569293,1.0,13.0,78.0,100.0,78,100
139.325,211.28004372159717,10.0,500.0,79.0,100.0,1.0,0.0,1.0,1.0,79.0,100.0,2.99,3.2480609600190697,1.0,13.0,79.0,100.0,79,100
173.61,226.72227041029737,10.5,500.0,80.0,100.0,1.0,0.0,1.0,1.0,80.0,100.0,3.45,3.3626626354720752,1.0,10.0,80.0,100.0,80,100
183.9,232.60307392637785,11.0,500.0,81.0,100.0,1.0,0.0,1.0,1.0,81.0,100.0,3.5,3.3391615714128,1.0,8.0,81.0,100.0,81,100
179.01,231.0411865880194,11.0,500.0,82.0,100.0,1.0,0.0,1.0,1.0,82.0,100.0,3.43,3.317393555187566,1.0,8.0,82.0,100.0,82,100
169.53,227.61197046728452,11.0,500.0,83.0,100.0,1.0,0.0,1.0,1.0,83.0,100.0,3.29,3.2689294883799493,1.0,8.0,83.0,100.0,83,100
150.06,219.25819574191522,11.0,500.0,84.0,100.0,1.0,0.0,1.0,1.0,84.0,100.0,3.01,3.151174384257399,1.0,8.0,84.0,100.0,84,100
135.39,211.5782075262006,11.0,500.0,85.0,100.0,1.0,0.0,1.0,1.0,85.0,100.0,2.8,3.0430248109405875,1.0,8.0,85.0,100.0,85,100
135.39,211.5782075262006,11.0,500.0,86.0,100.0,1.0,0.0,1.0,1.0,86.0,100.0,2.8,3.0430248109405875,1.0,8.0,86.0,100.0,86,100
120.72,202.5490103653928,11.0,500.0,87.0,100.0,1.0,0.0,1.0,1.0,87.0,100.0,2.59,2.915801776527341,1.0,8.0,87.0,100.0,87,100
115.83,199.20853671466992,11.0,500.0,88.0,100.0,1.0,0.0,1.0,1.0,88.0,100.0,2.52,2.868727941091661,1.0,8.0,88.0,100.0,88,100
101.16,188.07156722907376,11.0,500.0,89.0,100.0,1.0,0.0,1.0,1.0,89.0,100.0,2.31,2.7118075152930743,1.0,8.0,89.0,100.0,89,100
91.38,179.60060022171416,11.0,500.0,90.0,100.0,1.0,0.0,1.0,1.0,90.0,100.0,2.17,2.592508437787619,1.0,8.0,90.0,100.0,90,100
91.38,179.60060022171416,11.0,500.0,91.0,100.0,1.0,0.0,1.0,1.0,91.0,100.0,2.17,2.592508437787619,1.0,8.0,91.0,100.0,91,100
76.71,165.00268452361615,11.0,500.0,92.0,100.0,1.0,0.0,1.0,1.0,92.0,100.0,1.96,2.3871321706181248,1.0,8.0,92.0,100.0,92,100
66.93,153.73062512069612,11.0,500.0,93.0,100.0,1.0,0.0,1.0,1.0,93.0,100.0,1.82,2.2288113423975573,1.0,8.0,93.0,100.0,93,100
57.15,140.8865767204243,11.0,500.0,94.0,100.0,1.0,0.0,1.0,1.0,94.0,100.0,1.68,2.048804529475665,1.0,8.0,94.0,100.0,94,100
67.36545454545454,153.06262342880802,10.5,500.0,95.0,100.0,1.0,0.0,1.0,1.0,95.0,100.0,1.89,2.3276382880507875,1.0,10.0,95.0,100.0,95,100
77.59261904761905,164.66873084218776,10.5,500.0,96.0,100.0,1.0,0.0,1.0,1.0,96.0,100.0,2.05,2.515452245621054,1.0,10.0,96.0,100.0,96,100
85.53333333333335,174.50776487022003,11.0,500.0,97.0,100.0,1.0,0.0,1.0,1.0,97.0,100.0,2.1,2.5278449319529073,1.0,8.0,97.0,100.0,97,100
129.54333333333335,208.51030166397052,11.0,500.0,98.0,100.0,1.0,0.0,1.0,1.0,98.0,100.0,2.73,3.0028486475345373,1.0,8.0,98.0,100.0,98,100
175.8,230.05951403930248,11.0,500.0,99.0,100.0,1.0,0.0,1.0,1.0,99.0,100.0,3.36,3.293994535514593,1.0,8.0,99.0,100.0,99,100
210.03,239.19019440604168,11.0,500.0,100.0,100.0,1.0,0.0,1.0,1.0,100.0,100.0,3.85,3.424543765233553,1.0,8.0,100.0,100.0,100,100
278.49,242.3859111004598,11.0,500.0,101.0,100.0,1.0,0.0,1.0,1.0,101.0,100.0,4.83,3.4700288183241357,1.0,8.0,101.0,100.0,101,100
382.61,208.82700471921729,11.0,500.0,102.0,100.0,1.0,0.0,1.0,1.0,102.0,100.0,6.3,2.98496231131986,1.0,8.0,102.0,100.0,102,100
490.19,68.4563649341681,11.0,500.0,103.0,100.0,1.0,0.0,1.0,1.0,103.0,100.0,7.84,0.9971960689854324,1.0,8.0,103.0,100.0,103,100
490.19,68.4563649341681,11.0,500.0,104.0,100.0,1.0,0.0,1.0,1.0,104.0,100.0,7.84,0.9971960689854324,1.0,8.0,104.0,100.0,104,100
490.19,68.4563649341681,11.0,500.0,105.0,100.0,1.0,0.0,1.0,1.0,105.0,100.0,7.84,0.9971960689854324,1.0,8.0,105.0,100.0,105,100
490.19,68.4563649341681,11.0,500.0,106.0,100.0,1.0,0.0,1.0,1.0,106.0,100.0,7.84,0.9971960689854324,1.0,8.0,106.0,100.0,106,100
490.19,68.4563649341681,11.0,500.0,107.0,100.0,1.0,0.0,1.0,1.0,107.0,100.0,7.84,0.9971960689854324,1.0,8.0,107.0,100.0,107,100
490.19,68.4563649341681,11.0,500.0,108.0,100.0,1.0,0.0,1.0,1.0,108.0,100.0,7.84,0.9971960689854324,1.0,8.0,108.0,100.0,108,100
490.19,68.4563649341681,11.0,500.0,109.0,100.0,1.0,0.0,1.0,1.0,109.0,100.0,7.84,0.9971960689854324,1.0,8.0,109.0,100.0,109,100
490.19,68.4563649341681,11.0,500.0,110.0,100.0,1.0,0.0,1.0,1.0,110.0,100.0,7.84,0.9971960689854324,1.0,8.0,110.0,100.0,110,100
490.19,68.4563649341681,11.0,500.0,111.0,100.0,1.0,0.0,1.0,1.0,111.0,100.0,7.84,0.9971960689854324,1.0,8.0,111.0,100.0,111,100
490.19,68.4563649341681,11.0,500.0,112.0,100.0,1.0,0.0,1.0,1.0,112.0,100.0,7.84,0.9971960689854324,1.0,8.0,112.0,100.0,112,100
490.19,68.4563649341681,11.0,500.0,113.0,100.0,1.0,0.0,1.0,1.0,113.0,100.0,7.84,0.9971960689854324,1.0,8.0,113.0,100.0,113,100
490.19,68.4563649341681,11.0,500.0,114.0,100.0,1.0,0.0,1.0,1.0,114.0,100.0,7.84,0.9971960689854324,1.0,8.0,114.0,100.0,114,100
490.19,68.4563649341681,11.0,500.0,115.0,100.0,1.0,0.0,1.0,1.0,115.0,100.0,7.84,0.9971960689854324,1.0,8.0,115.0,100.0,115,100
490.19,68.4563649341681,11.0,500.0,116.0,100.0,1.0,0.0,1.0,1.0,116.0,100.0,7.84,0.9971960689854324,1.0,8.0,116.0,100.0,116,100
490.19,68.4563649341681,11.0,500.0,117.0,100.0,1.0,0.0,1.0,1.0,117.0,100.0,7.84,0.9971960689854324,1.0,8.0,117.0,100.0,117,100
490.19,68.4563649341681,11.0,500.0,118.0,100.0,1.0,0.0,1.0,1.0,118.0,100.0,7.84,0.9971960689854324,1.0,8.0,118.0,100.0,118,100
490.19,68.4563649341681,11.0,500.0,119.0,100.0,1.0,0.0,1.0,1.0,119.0,100.0,7.84,0.9971960689854324,1.0,8.0,119.0,100.0,119,100
490.19,68.4563649341681,11.0,500.0,120.0,100.0,1.0,0.0,1.0,1.0,120.0,100.0,7.84,0.9971960689854324,1.0,8.0,120.0,100.0,120,100
490.19,68.4563649341681,11.0,500.0,121.0,100.0,1.0,0.0,1.0,1.0,121.0,100.0,7.84,0.9971960689854324,1.0,8.0,121.0,100.0,121,100
490.19,68.4563649341681,11.0,500.0,122.0,100.0,1.0,0.0,1.0,1.0,122.0,100.0,7.84,0.9971960689854324,1.0,8.0,122.0,100.0,122,100
490.19,68.4563649341681,11.0,500.0,123.0,100.0,1.0,0.0,1.0,1.0,123.0,100.0,7.84,0.9971960689854324,1.0,8.0,123.0,100.0,123,100
490.19,68.4563649341681,11.0,500.0,124.0,100.0,1.0,0.0,1.0,1.0,124.0,100.0,7.84,0.9971960689854324,1.0,8.0,124.0,100.0,124,100
490.19,68.4563649341681,11.0,500.0,125.0,100.0,1.0,0.0,1.0,1.0,125.0,100.0,7.84,0.9971960689854324,1.0,8.0,125.0,100.0,125,100
490.19,68.4563649341681,11.0,500.0,126.0,100.0,1.0,0.0,1.0,1.0,126.0,100.0,7.84,0.9971960689854324,1.0,8.0,126.0,100.0,126,100
490.19,68.4563649341681,11.0,500.0,127.0,100.0,1.0,0.0,1.0,1.0,127.0,100.0,7.84,0.9971960689854324,1.0,8.0,127.0,100.0,127,100
490.19,68.4563649341681,11.0,500.0,128.0,100.0,1.0,0.0,1.0,1.0,128.0,100.0,7.84,0.9971960689854324,1.0,8.0,128.0,100.0,128,100
490.19,68.4563649341681,11.0,500.0,129.0,100.0,1.0,0.0,1.0,1.0,129.0,100.0,7.84,0.9971960689854324,1.0,8.0,129.0,100.0,129,100
490.19,68.4563649341681,11.0,500.0,130.0,100.0,1.0,0.0,1.0,1.0,130.0,100.0,7.84,0.9971960689854324,1.0,8.0,130.0,100.0,130,100
490.19,68.4563649341681,11.0,500.0,131.0,100.0,1.0,0.0,1.0,1.0,131.0,100.0,7.84,0.9971960689854324,1.0,8.0,131.0,100.0,131,100
490.19,68.4563649341681,11.0,500.0,132.0,100.0,1.0,0.0,1.0,1.0,132.0,100.0,7.84,0.9971960689854324,1.0,8.0,132.0,100.0,132,100
490.19,68.4563649341681,11.0,500.0,133.0,100.0,1.0,0.0,1.0,1.0,133.0,100.0,7.84,0.9971960689854324,1.0,8.0,133.0,100.0,133,100
490.19,68.4563649341681,11.0,500.0,134.0,100.0,1.0,0.0,1.0,1.0,134.0,100.0,7.84,0.9971960689854324,1.0,8.0,134.0,100.0,134,100
490.19,68.4563649341681,11.0,500.0,135.0,100.0,1.0,0.0,1.0,1.0,135.0,100.0,7.84,0.9971960689854324,1.0,8.0,135.0,100.0,135,100
490.19,68.4563649341681,11.0,500.0,136.0,100.0,1.0,0.0,1.0,1.0,136.0,100.0,7.84,0.9971960689854324,1.0,8.0,136.0,100.0,136,100
490.19,68.4563649341681,11.0,500.0,137.0,100.0,1.0,0.0,1.0,1.0,137.0,100.0,7.84,0.9971960689854324,1.0,8.0,137.0,100.0,137,100
490.19,68.4563649341681,11.0,500.0,138.0,100.0,1.0,0.0,1.0,1.0,138.0,100.0,7.84,0.9971960689854324,1.0,8.0,138.0,100.0,138,100
490.19,68.4563649341681,11.0,500.0,139.0,100.0,1.0,0.0,1.0,1.0,139.0,100.0,7.84,0.9971960689854324,1.0,8.0,139.0,100.0,139,100
490.19,68.4563649341681,11.0,500.0,140.0,100.0,1.0,0.0,1.0,1.0,140.0,100.0,7.84,0.9971960689854324,1.0,8.0,140.0,100.0,140,100
490.19,68.4563649341681,11.0,500.0,141.0,100.0,1.0,0.0,1.0,1.0,141.0,100.0,7.84,0.9971960689854324,1.0,8.0,141.0,100.0,141,100
490.19,68.4563649341681,11.0,500.0,142.0,100.0,1.0,0.0,1.0,1.0,142.0,100.0,7.84,0.9971960689854324,1.0,8.0,142.0,100.0,142,100
490.19,68.4563649341681,11.0,500.0,143.0,100.0,1.0,0.0,1.0,1.0,143.0,100.0,7.84,0.9971960689854324,1.0,8.0,143.0,100.0,143,100
490.19,68.4563649341681,11.0,500.0,144.0,100.0,1.0,0.0,1.0,1.0,144.0,100.0,7.84,0.9971960689854324,1.0,8.0,144.0,100.0,144,100
490.19,68.4563649341681,11.0,500.0,145.0,100.0,1.0,0.0,1.0,1.0,145.0,100.0,7.84,0.9971960689854324,1.0,8.0,145.0,100.0,145,100
490.19,68.4563649341681,11.0,500.0,146.0,100.0,1.0,0.0,1.0,1.0,146.0,100.0,7.84,0.9971960689854324,1.0,8.0,146.0,100.0,146,100
490.19,68.4563649341681,11.0,500.0,147.0,100.0,1.0,0.0,1.0,1.0,147.0,100.0,7.84,0.9971960689854324,1.0,8.0,147.0,100.0,147,100
490.19,68.4563649341681,11.0,500.0,148.0,100.0,1.0,0.0,1.0,1.0,148.0,100.0,7.84,0.9971960689854324,1.0,8.0,148.0,100.0,148,100
490.19,68.4563649341681,11.0,500.0,149.0,100.0,1.0,0.0,1.0,1.0,149.0,100.0,7.84,0.9971960689854324,1.0,8.0,149.0,100.0,149,100
490.19,68.4563649341681,11.0,500.0,150.0,100.0,1.0,0.0,1.0,1.0,150.0,100.0,7.84,0.9971960689854324,1.0,8.0,150.0,100.0,150,100
490.19,68.4563649341681,11.0,500.0,151.0,100.0,1.0,0.0,1.0,1.0,151.0,100.0,7.84,0.9971960689854324,1.0,8.0,151.0,100.0,151,100
490.19,68.4563649341681,11.0,500.0,152.0,100.0,1.0,0.0,1.0,1.0,152.0,100.0,7.84,0.9971960689854324,1.0,8.0,152.0,100.0,152,100
490.19,68.4563649341681,11.0,500.0,153.0,100.0,1.0,0.0,1.0,1.0,153.0,100.0,7.84,0.9971960689854324,1.0,8.0,153.0,100.0,153,100
490.19,68.4563649341681,11.0,500.0,154.0,100.0,1.0,0.0,1.0,1.0,154.0,100.0,7.84,0.9971960689854324,1.0,8.0,154.0,100.0,154,100
490.19,68.4563649341681,11.0,500.0,155.0,100.0,1.0,0.0,1.0,1.0,155.0,100.0,7.84,0.9971960689854324,1.0,8.0,155.0,100.0,155,100
490.19,68.4563649341681,11.0,500.0,156.0,100.0,1.0,0.0,1.0,1.0,156.0,100.0,7.84,0.9971960689854324,1.0,8.0,156.0,100.0,156,100
490.19,68.4563649341681,11.0,500.0,157.0,100.0,1.0,0.0,1.0,1.0,157.0,100.0,7.84,0.9971960689854324,1.0,8.0,157.0,100.0,157,100
490.19,68.4563649341681,11.0,500.0,158.0,100.0,1.0,0.0,1.0,1.0,158.0,100.0,7.84,0.9971960689854324,1.0,8.0,158.0,100.0,158,100
490.19,68.4563649341681,11.0,500.0,159.0,100.0,1.0,0.0,1.0,1.0,159.0,100.0,7.84,0.9971960689854324,1.0,8.0,159.0,100.0,159,100
490.19,68.4563649341681,11.0,500.0,160.0,100.0,1.0,0.0,1.0,1.0,160.0,100.0,7.84,0.9971960689854324,1.0,8.0,160.0,100.0,160,100
490.19,68.4563649341681,11.0,500.0,161.0,100.0,1.0,0.0,1.0,1.0,161.0,100.0,7.84,0.9971960689854324,1.0,8.0,161.0,100.0,161,100
490.19,68.4563649341681,11.0,500.0,162.0,100.0,1.0,0.0,1.0,1.0,162.0,100.0,7.84,0.9971960689854324,1.0,8.0,162.0,100.0,162,100
490.19,68.4563649341681,11.0,500.0,163.0,100.0,1.0,0.0,1.0,1.0,163.0,100.0,7.84,0.9971960689854324,1.0,8.0,163.0,100.0,163,100
490.19,68.4563649341681,11.0,500.0,164.0,100.0,1.0,0.0,1.0,1.0,164.0,100.0,7.84,0.9971960689854324,1.0,8.0,164.0,100.0,164,100
490.19,68.4563649341681,11.0,500.0,165.0,100.0,1.0,0.0,1.0,1.0,165.0,100.0,7.84,0.9971960689854324,1.0,8.0,165.0,100.0,165,100
490.19,68.4563649341681,11.0,500.0,166.0,100.0,1.0,0.0,1.0,1.0,166.0,100.0,7.84,0.9971960689854324,1.0,8.0,166.0,100.0,166,100
490.19,68.4563649341681,11.0,500.0,167.0,100.0,1.0,0.0,1.0,1.0,167.0,100.0,7.84,0.9971960689854324,1.0,8.0,167.0,100.0,167,100
490.19,68.4563649341681,11.0,500.0,168.0,100.0,1.0,0.0,1.0,1.0,168.0,100.0,7.84,0.9971960689854324,1.0,8.0,168.0,100.0,168,100
490.19,68.4563649341681,11.0,500.0,169.0,100.0,1.0,0.0,1.0,1.0,169.0,100.0,7.84,0.9971960689854324,1.0,8.0,169.0,100.0,169,100
490.19,68.4563649341681,11.0,500.0,170.0,100.0,1.0,0.0,1.0,1.0,170.0,100.0,7.84,0.9971960689854324,1.0,8.0,170.0,100.0,170,100
490.19,68.4563649341681,11.0,500.0,171.0,100.0,1.0,0.0,1.0,1.0,171.0,100.0,7.84,0.9971960689854324,1.0,8.0,171.0,100.0,171,100
490.19,68.4563649341681,11.0,500.0,172.0,100.0,1.0,0.0,1.0,1.0,172.0,100.0,7.84,0.9971960689854324,1.0,8.0,172.0,100.0,172,100
490.19,68.4563649341681,11.0,500.0,173.0,100.0,1.0,0.0,1.0,1.0,173.0,100.0,7.84,0.9971960689854324,1.0,8.0,173.0,100.0,173,100
490.19,68.4563649341681,11.0,500.0,174.0,100.0,1.0,0.0,1.0,1.0,174.0,100.0,7.84,0.9971960689854324,1.0,8.0,174.0,100.0,174,100
490.19,68.4563649341681,11.0,500.0,175.0,100.0,1.0,0.0,1.0,1.0,175.0,100.0,7.84,0.9971960689854324,1.0,8.0,175.0,100.0,175,100
490.19,68.4563649341681,11.0,500.0,176.0,100.0,1.0,0.0,1.0,1.0,176.0,100.0,7.84,0.9971960689854324,1.0,8.0,176.0,100.0,176,100
490.19,68.4563649341681,11.0,500.0,177.0,100.0,1.0,0.0,1.0,1.0,177.0,100.0,7.84,0.9971960689854324,1.0,8.0,177.0,100.0,177,100
490.19,68.4563649341681,11.0,500.0,178.0,100.0,1.0,0.0,1.0,1.0,178.0,100.0,7.84,0.9971960689854324,1.0,8.0,178.0,100.0,178,100
490.19,68.4563649341681,11.0,500.0,179.0,100.0,1.0,0.0,1.0,1.0,179.0,100.0,7.84,0.9971960689854324,1.0,8.0,179.0,100.0,179,100
490.19,68.4563649341681,11.0,500.0,180.0,100.0,1.0,0.0,1.0,1.0,180.0,100.0,7.84,0.9971960689854324,1.0,8.0,180.0,100.0,180,100
490.19,68.4563649341681,11.0,500.0,181.0,100.0,1.0,0.0,1.0,1.0,181.0,100.0,7.84,0.9971960689854324,1.0,8.0,181.0,100.0,181,100
490.19,68.4563649341681,11.0,500.0,182.0,100.0,1.0,0.0,1.0,1.0,182.0,100.0,7.84,0.9971960689854324,1.0,8.0,182.0,100.0,182,100
490.19,68.4563649341681,11.0,500.0,183.0,100.0,1.0,0.0,1.0,1.0,183.0,100.0,7.84,0.9971960689854324,1.0,8.0,183.0,100.0,183,100
490.19,68.4563649341681,11.0,500.0,184.0,100.0,1.0,0.0,1.0,1.0,184.0,100.0,7.84,0.9971960689854324,1.0,8.0,184.0,100.0,184,100
490.19,68.4563649341681,11.0,500.0,185.0,100.0,1.0,0.0,1.0,1.0,185.0,100.0,7.84,0.9971960689854324,1.0,8.0,185.0,100.0,185,100
490.19,68.4563649341681,11.0,500.0,186.0,100.0,1.0,0.0,1.0,1.0,186.0,100.0,7.84,0.9971960689854324,1.0,8.0,186.0,100.0,186,100
490.19,68.4563649341681,11.0,500.0,187.0,100.0,1.0,0.0,1.0,1.0,187.0,100.0,7.84,0.9971960689854324,1.0,8.0,187.0,100.0,187,100
490.19,68.4563649341681,11.0,500.0,188.0,100.0,1.0,0.0,1.0,1.0,188.0,100.0,7.84,0.9971960689854324,1.0,8.0,188.0,100.0,188,100
490.19,68.4563649341681,11.0,500.0,189.0,100.0,1.0,0.0,1.0,1.0,189.0,100.0,7.84,0.9971960689854324,1.0,8.0,189.0,100.0,189,100
490.19,68.4563649341681,11.0,500.0,190.0,100.0,1.0,0.0,1.0,1.0,190.0,100.0,7.84,0.9971960689854324,1.0,8.0,190.0,100.0,190,100
490.19,68.4563649341681,11.0,500.0,191.0,100.0,1.0,0.0,1.0,1.0,191.0,100.0,7.84,0.9971960689854324,1.0,8.0,191.0,100.0,191,100
490.19,68.4563649341681,11.0,500.0,192.0,100.0,1.0,0.0,1.0,1.0,192.0,100.0,7.84,0.9971960689854324,1.0,8.0,192.0,100.0,192,100
490.19,68.4563649341681,11.0,500.0,193.0,100.0,1.0,0.0,1.0,1.0,193.0,100.0,7.84,0.9971960689854324,1.0,8.0,193.0,100.0,193,100
490.19,68.4563649341681,11.0,500.0,194.0,100.0,1.0,0.0,1.0,1.0,194.0,100.0,7.84,0.9971960689854324,1.0,8.0,194.0,100.0,194,100
490.19,68.4563649341681,11.0,500.0,195.0,100.0,1.0,0.0,1.0,1.0,195.0,100.0,7.84,0.9971960689854324,1.0,8.0,195.0,100.0,195,100
490.19,68.4563649341681,11.0,500.0,196.0,100.0,1.0,0.0,1.0,1.0,196.0,100.0,7.84,0.9971960689854324,1.0,8.0,196.0,100.0,196,100
490.19,68.4563649341681,11.0,500.0,197.0,100.0,1.0,0.0,1.0,1.0,197.0,100.0,7.84,0.9971960689854324,1.0,8.0,197.0,100.0,197,100
490.19,68.4563649341681,11.0,500.0,198.0,100.0,1.0,0.0,1.0,1.0,198.0,100.0,7.84,0.9971960689854324,1.0,8.0,198.0,100.0,198,100
490.19,68.4563649341681,11.0,500.0,199.0,100.0,1.0,0.0,1.0,1.0,199.0,100.0,7.84,0.9971960689854324,1.0,8.0,199.0,100.0,199,100
490.19,68.4563649341681,11.0,500.0,200.0,100.0,1.0,0.0,1.0,1.0,200.0,100.0,7.84,0.9971960689854324,1.0,8.0,200.0,100.0,200,100
