system_type,solver,threads,nbpts,schur,arith,sym,tps_facto,tps_solve,error,rm_peak
coupled,mumps_hmat,24,10000,1776,z,1,1.290443,0.056812,2.8811e-04,615.227
coupled,mumps_hmat,24,25000,3200,z,1,3.885257,0.058362,3.2506e-04,1283.15
coupled,mumps_hmat,24,50000,5040,z,1,9.157791,0.120526,4.7137e-04,2293.52
coupled,mumps_hmat,24,100000,8109,z,1,22.406362,0.140019,5.9821e-04,4978.2
coupled,mumps_hmat,24,250000,14835,z,1,87.466921,0.322015,7.7256e-04,16364.1
coupled,mumps_hmat,24,500000,23577,z,1,225.013896,0.758073,7.8253e-04,44608.3
coupled,mumps_hmat,24,1000000,37169,z,1,685.550250,1.289597,1.4643e-03,105721
fembem,hmat,24,10000,0,z,1,1.315240,0.292763,3.3784e-04,634.262
fembem,hmat,24,25000,0,z,1,5.449593,0.922594,3.8738e-04,1523.71
fembem,hmat,24,50000,0,z,1,17.725683,2.633468,4.6461e-04,2727.72
fembem,hmat,24,100000,0,z,1,46.932535,6.307676,4.5878e-04,5966.46
fembem,hmat,24,250000,0,z,1,96.121523,13.461075,5.5042e-04,12424.7
fembem,hmat,24,500000,0,z,1,204.020447,29.032492,4.9994e-04,33104.1
fembem,hmat,24,1000000,0,z,1,655.171741,66.424248,8.0230e-04,80206.3
fembem,mumps,24,10000,0,z,1,2.279409,0.170363,6.1005e-04,762.238
fembem,mumps,24,25000,0,z,1,6.528815,0.726738,1.4368e-03,1708.23
fembem,mumps,24,50000,0,z,1,16.728383,1.149887,1.4161e-03,3074.28
fembem,mumps,24,100000,0,z,1,45.669069,2.416118,1.5936e-03,6074.82
